[#3981] build asterisk on trunk fails for not finding libtool

Document created by Aaronwu Employee on Aug 28, 2013
Version 1Show Document
  • View in full screen mode

[#3981] build asterisk on trunk fails for not finding libtool

Submitted By: Mingquan Pan

Open Date

2008-03-24 04:40:00     Close Date

2008-04-15 03:53:16

Priority:

Medium     Assignee:

Sonic Zhang

Status:

Closed     Fixed In Release:

N/A

Found In Release:

N/A     Release:

Category:

N/A     Board:

N/A

Processor:

BF537     Silicon Revision:

Is this bug repeatable?:

Yes     Resolution:

Fixed

Uboot version or rev.:

    Toolchain version or rev.:

08r1-8

App binary format:

N/A     

Summary: build asterisk on trunk fails for not finding libtool

Details:

 

build asterisk on trunk fails for not finding libtool.

 

make[5]: Leaving directory `/home/test/work/cruise/checkouts/uclinux-dist/user/blkfin-apps/asterisk/db1-ast'

make[5]: Entering directory `/home/test/work/cruise/checkouts/uclinux-dist/user/blkfin-apps/asterisk/stdtime'

../mkdep -pipe -Wall -g -O2      -mcpu=bf537-0.2 -pipe  -Wall -Wstrict-prototypes -Wmissing-prototypes -Wmissing-declarations -g  -Iinclude -I../include -D_REENTRANT -D_GNU_SOURCE  -O6    -DZAPTEL_OPTIMIZATIONS -DASTERISK_VERSION=\"1.0.9\" -DINSTALL_PREFIX=\"\" -DASTETCDIR=\"/etc/asterisk\" -DASTLIBDIR=\"/usr/lib/asterisk\" -DASTVARLIBDIR=\"/var/lib/asterisk\" -DASTVARRUNDIR=\"/var/run\" -DASTSPOOLDIR=\"/var/spool/asterisk\" -DASTLOGDIR=\"/var/log/asterisk\" -DASTCONFPATH=\"/etc/asterisk/asterisk.conf\" -DASTMODDIR=\"/usr/lib/asterisk/modules\" -DASTAGIDIR=\"/var/lib/asterisk/agi-bin\"     -DBUSYDETECT_MARTIN     -DLOW_MEMORY  -I/home/test/work/cruise/checkouts/uclinux-dist/lib/libtool/DESTDIR/usr/include -I/home/test/work/cruise/checkouts/uclinux-dist/lib/libssl/include -I/home/test/work/cruise/checkouts/uclinux-dist/lib/ncurses/include -I/home/test/work/cruise/checkouts/uclinux-dist/lib/zlib -I/home/test/work/cruise/checkouts/uclinux-dist/lib/blackfin-gsm/gsm/inc -I/home/test/work/cruise/checkouts/uclinux-dist/lib/speex/DESTDIR/usr/include/ -I/home/test/work/cruise/checkouts/uclinux-dist/user/blkfin-apps/zaptel *.c

make[5]: Leaving directory `/home/test/work/cruise/checkouts/uclinux-dist/user/blkfin-apps/asterisk/stdtime'

for x in res channels pbx apps codecs formats cdr editline db1-ast stdtime; do make -C $x || exit 1 ; done

make[5]: Entering directory `/home/test/work/cruise/checkouts/uclinux-dist/user/blkfin-apps/asterisk/res'

/home/test/work/cruise/checkouts/uclinux-dist/lib/libtool/DESTDIR/usr/bin/libtool --tag=CC --mode=compile bfin-uclinux-gcc  -c -o res_adsi.lo res_adsi.c -prefer-non-pic \

        -Dload_module=res_adsi_LTX_load_module -Dunload_module=res_adsi_LTX_unload_module -Dusecount=res_adsi_LTX_usecount -Ddescription=res_adsi_LTX_description -Dkey=res_adsi_LTX_key -Dreload=res_adsi_LTX_reload  -pipe -Wall -g -O2      -mcpu=bf537-0.2 -pipe  -Wall -Wstrict-prototypes -Wmissing-prototypes -Wmissing-declarations -g  -Iinclude -I../include -D_REENTRANT -D_GNU_SOURCE  -O6    -DZAPTEL_OPTIMIZATIONS -DASTERISK_VERSION=\"1.0.9\" -DINSTALL_PREFIX=\"\" -DASTETCDIR=\"/etc/asterisk\" -DASTLIBDIR=\"/usr/lib/asterisk\" -DASTVARLIBDIR=\"/var/lib/asterisk\" -DASTVARRUNDIR=\"/var/run\" -DASTSPOOLDIR=\"/var/spool/asterisk\" -DASTLOGDIR=\"/var/log/asterisk\" -DASTCONFPATH=\"/etc/asterisk/asterisk.conf\" -DASTMODDIR=\"/usr/lib/asterisk/modules\" -DASTAGIDIR=\"/var/lib/asterisk/agi-bin\"     -DBUSYDETECT_MARTIN     -DLOW_MEMORY  -I/home/test/work/cruise/checkouts/uclinux-dist/lib/libtool/DESTDIR/usr/include -I/home/test/work/cruise/checkouts/uclinux-dist/lib/libssl/include -I/home/test/work/cruise/checkouts/uclinux-dist/lib/ncurses/include -I/home/test/work/cruise/checkouts/uclinux-dist/lib/zlib -I/home/test/work/cruise/checkouts/uclinux-dist/lib/blackfin-gsm/gsm/inc -I/home/test/work/cruise/checkouts/uclinux-dist/lib/speex/DESTDIR/usr/include/ -I/home/test/work/cruise/checkouts/uclinux-dist/user/blkfin-apps/zaptel -DOPENSSL_NO_KRB5

make[5]: /home/test/work/cruise/checkouts/uclinux-dist/lib/libtool/DESTDIR/usr/bin/libtool: Command not found

make[5]: *** [res_adsi.lo] Error 127

make[5]: Leaving directory `/home/test/work/cruise/checkouts/uclinux-dist/user/blkfin-apps/asterisk/res'

make[4]: *** [subdirs] Error 1

make[4]: Leaving directory `/home/test/work/cruise/checkouts/uclinux-dist/user/blkfin-apps/asterisk'

make[3]: *** [all] Error 2

make[3]: Leaving directory `/home/test/work/cruise/checkouts/uclinux-dist/user/blkfin-apps'

make[2]: *** [blkfin-apps] Error 2

make[2]: Leaving directory `/home/test/work/cruise/checkouts/uclinux-dist/user'

make[1]: *** [all] Error 2

make[1]: Leaving directory `/home/test/work/cruise/checkouts/uclinux-dist/user'

make: *** [subdirs] Error 1

ERROR: Error somewhere during make

 

 

Follow-ups

 

--- Sonic Zhang                                              2008-04-14 06:02:23

Fixed

 

--- Mingquan Pan                                             2008-04-15 03:53:16

Yes,close.

 

 

 

    Files

    Changes

    Commits

    Dependencies

    Duplicates

    Associations

    Tags

 

File Name     File Type     File Size     Posted By

No Files Were Found

Attachments

    Outcomes