[#3963] build usb host fails at isp1362-hcd.c with 3.4 toolchain.

Document created by Aaronwu Employee on Aug 28, 2013
Version 1Show Document
  • View in full screen mode

[#3963] build usb host fails at isp1362-hcd.c with 3.4 toolchain.

Submitted By: Mingquan Pan

Open Date

2008-03-10 04:55:17     Close Date

2008-04-02 03:11:16

Priority:

Medium     Assignee:

Michael Hennerich

Status:

Closed     Fixed In Release:

N/A

Found In Release:

N/A     Release:

Category:

N/A     Board:

STAMP

Processor:

BF537     Silicon Revision:

Is this bug repeatable?:

Yes     Resolution:

Fixed

Uboot version or rev.:

    Toolchain version or rev.:

3.4 08r1-8

App binary format:

N/A     

Summary: build usb host fails at isp1362-hcd.c with 3.4 toolchain.

Details:

 

build usb host fails at isp1362-hcd.c with 3.4 toolchain in 08r1-8.

 

  LD      drivers/rtc/built-in.o^M

  CC      drivers/serial/serial_core.o^M

  CC      drivers/serial/bfin_5xx.o^M

  LD      drivers/serial/built-in.o^M

  CC      drivers/spi/spi.o^M

  CC      drivers/spi/spi_bfin5xx.o^M

  LD      drivers/spi/built-in.o^M

  CC      drivers/usb/core/usb.o^M

  CC      drivers/usb/core/hub.o^M

  CC      drivers/usb/core/hcd.o^M

  CC      drivers/usb/core/urb.o^M

  CC      drivers/usb/core/message.o^M

  CC      drivers/usb/core/driver.o^M

  CC      drivers/usb/core/config.o^M

  CC      drivers/usb/core/file.o^M

  CC      drivers/usb/core/buffer.o^M

  CC      drivers/usb/core/sysfs.o^M

  CC      drivers/usb/core/endpoint.o^M

  CC      drivers/usb/core/devio.o^M

  CC      drivers/usb/core/notify.o^M

  CC      drivers/usb/core/generic.o^M

  CC      drivers/usb/core/quirks.o^M

  LD      drivers/usb/core/usbcore.o^M

  LD      drivers/usb/core/built-in.o^M

  CC      drivers/usb/host/isp1362-hcd.o^M

drivers/usb/host/isp1362-hcd.c: In function `isp1362_irq':^M

drivers/usb/host/isp1362-hcd.c:1125: error: `typeof' applied to a bit-field^M

drivers/usb/host/isp1362-hcd.c: In function `isp1362_probe':^M

drivers/usb/host/isp1362-hcd.c:2908: warning: `deprecated_irq_flag' is deprecated (declared at include/linux/interrupt.h:66)^M

drivers/usb/host/isp1362-hcd.c:2908: warning: `deprecated_irq_flag' is deprecated (declared at include/linux/interrupt.h:66)^M

make[4]: *** [drivers/usb/host/isp1362-hcd.o] Error 1^M

make[3]: *** [drivers/usb/host] Error 2^M

make[2]: *** [drivers/usb] Error 2^M

make[1]: *** [drivers] Error 2^M

make[1]: Leaving directory `/home/test/work/cruise/checkouts/uclinux-dist/linux-2.6.x'^M

make: *** [linux] Error 1^M

 

Follow-ups

 

--- Michael Hennerich                                        2008-03-17 11:24:41

Fixed

-Michael

 

--- Mingquan Pan                                             2008-04-02 03:11:12

Yes,fixed.Close.

 

 

 

    Files

    Changes

    Commits

    Dependencies

    Duplicates

    Associations

    Tags

 

File Name     File Type     File Size     Posted By

No Files Were Found

Attachments

    Outcomes