[#3831] build bfin_pflags.c fails

Document created by Aaronwu Employee on Aug 28, 2013
Version 1Show Document
  • View in full screen mode

[#3831] build bfin_pflags.c fails

Submitted By: Mingquan Pan

Open Date

2008-01-15 21:07:43     Close Date

2008-01-17 20:03:02

Priority:

Medium     Assignee:

Michael Hennerich

Status:

Closed     Fixed In Release:

N/A

Found In Release:

N/A     Release:

Category:

N/A     Board:

N/A

Processor:

N/A     Silicon Revision:

Is this bug repeatable?:

Yes     Resolution:

Fixed

Uboot version or rev.:

    Toolchain version or rev.:

Oct_07

App binary format:

N/A     

Summary: build bfin_pflags.c fails

Details:

 

build bfin_pflags.c fails from Jan 11 on svn head.

 

rm -f linux-2.6.x/usr/initramfs_data.cpio.gz^M

make ARCH=blackfin   CROSS_COMPILE=bfin-uclinux- -j1 -C linux-2.6.x  || exit 1^M

make[1]: Entering directory `/home/test/work/cruise/checkouts/uclinux-dist/linux-2.6.x'^M

  SYMLINK include/asm-blackfin/mach-bf537 -> include/asm-blackfin/mach^M

  CHK     include/linux/version.h^M

  CHK     include/linux/utsrelease.h^M

  CALL    scripts/checksyscalls.sh^M

  CHK     include/linux/compile.h^M

  GEN     usr/initramfs_data.cpio.gz^M

  AS      usr/initramfs_data.o^M

  LD      usr/built-in.o^M

  CC      arch/blackfin/mach-bf537/boards/stamp.o^M

  LD      arch/blackfin/mach-bf537/boards/built-in.o^M

  GZIP    kernel/config_data.gz^M

  IKCFG   kernel/config_data.h^M

  CC      kernel/configs.o^M

  LD      kernel/built-in.o^M

  CC      drivers/char/bfin_pflags.o^M

drivers/char/bfin_pflags.c: In function 鈥榩flags_write鈥�^M

drivers/char/bfin_pflags.c:251: error: too few arguments to function 鈥榞pio_direction_output鈥^M

drivers/char/bfin_pflags.c: In function 鈥榖lackfin_pflags_init鈥�^M

drivers/char/bfin_pflags.c:442: warning: label 鈥榚xit鈥�defined but not used^M

make[3]: *** [drivers/char/bfin_pflags.o] Error 1^M

make[2]: *** [drivers/char] Error 2^M

make[1]: *** [drivers] Error 2^M

make[1]: Leaving directory `/home/test/work/cruise/checkouts/uclinux-dist/linux-2.6.x'^M

make: *** [linux] Error 1^M

 

 

 

Follow-ups

 

--- Michael Hennerich                                        2008-01-16 03:19:02

Fixed

-Michael

 

--- Mingquan Pan                                             2008-01-17 22:04:26

Yes.

 

 

 

    Files

    Changes

    Commits

    Dependencies

    Duplicates

    Associations

    Tags

 

File Name     File Type     File Size     Posted By

No Files Were Found

Attachments

    Outcomes