2011-01-17 00:47:27     FFMPEG 0.6.1

Document created by Aaronwu Employee on Aug 26, 2013
Version 1Show Document
  • View in full screen mode

2011-01-17 00:47:27     FFMPEG 0.6.1

Blair Fredericks (CANADA)

Message: 97491   

 

Hi,

 

I get the following error when trying to compile FFMPEG 0.6.1

 

/opt/uClinux/bfin-linux-uclibc/lib/gcc/bfin-linux-uclibc/4.3.5/../../../../bfin-linux-uclibc/bin/ld: warning: type and size of dynamic symbol `__ROFIXUP_LIST__@@LIBAVCODEC_52' are not defined

/opt/uClinux/bfin-linux-uclibc/lib/gcc/bfin-linux-uclibc/4.3.5/../../../../bfin-linux-uclibc/bin/ld: warning: type and size of dynamic symbol `__ROFIXUP_END__@@LIBAVCODEC_52' are not defined

/opt/uClinux/bfin-linux-uclibc/bfin-linux-uclibc/runtime/usr/lib/crt1.o: In function `__start':

(.text+0x12): warning: relocation references symbol not defined in the module

/opt/uClinux/bfin-linux-uclibc/lib/gcc/bfin-linux-uclibc/4.3.5/../../../../bfin-linux-uclibc/bin/ld: final link failed: Nonrepresentable section on output

collect2: ld returned 1 exit status

make[4]: *** [ffserver_g] Error 1

/opt/uClinux/bfin-linux-uclibc/lib/gcc/bfin-linux-uclibc/4.3.5/../../../../bfin-linux-uclibc/bin/ld: warning: type and size of dynamic symbol `__ROFIXUP_LIST__@@LIBAVCODEC_52' are not defined

/opt/uClinux/bfin-linux-uclibc/lib/gcc/bfin-linux-uclibc/4.3.5/../../../../bfin-linux-uclibc/bin/ld: warning: type and size of dynamic symbol `__ROFIXUP_END__@@LIBAVCODEC_52' are not defined

/opt/uClinux/bfin-linux-uclibc/bfin-linux-uclibc/runtime/usr/lib/crt1.o: In function `__start':

(.text+0x12): warning: relocation references symbol not defined in the module

/opt/uClinux/bfin-linux-uclibc/lib/gcc/bfin-linux-uclibc/4.3.5/../../../../bfin-linux-uclibc/bin/ld: final link failed: Nonrepresentable section on output

collect2: ld returned 1 exit status

make[4]: *** [ffplay_g] Error 1

make[4]: Leaving directory `/home/bfredericks/Desktop/blackfin-linux-dist/lib/ffmpeg/build'

make[3]: *** [all] Error 2

make[3]: Leaving directory `/home/bfredericks/Desktop/blackfin-linux-dist/lib/ffmpeg'

make[2]: *** [ffmpeg] Error 2

make[2]: Leaving directory `/home/bfredericks/Desktop/blackfin-linux-dist/lib'

make[1]: *** [all] Error 2

make[1]: Leaving directory `/home/bfredericks/Desktop/blackfin-linux-dist/lib'

make: *** [subdirs] Error 1

[bfredericks@blair blackfin-linux-dist]$

 

Thanks,

 

Blair Fredericks

QuoteReplyEditDelete

 

 

2011-01-17 01:18:30     Re: FFMPEG 0.6.1

Aaron Wu (CHINA)

Message: 97492   

 

what's your software and tool chain version please.

QuoteReplyEditDelete

 

 

2011-01-17 15:28:43     Re: FFMPEG 0.6.1

Blair Fredericks (CANADA)

Message: 97506   

 

Hi Aaron,

 

toolchain: bfin-linux-uclibc-gcc release gcc version 4.3.5 (ADI-2010R1-RC4)

uCLinux Version 2010R1-RC5

 

Thanks,

 

Blair Fredericks

QuoteReplyEditDelete

 

 

2011-01-17 19:55:12     Re: FFMPEG 0.6.1

Mike Frysinger (UNITED STATES)

Message: 97508   

 

ffmpeg 0.6.1 isnt in the tree.  so are you attempting to add it yourself ?

 

post the *full* build log from ffmpeg

QuoteReplyEditDelete

 

 

2011-01-17 23:36:54     Re: FFMPEG 0.6.1

Blair Fredericks (CANADA)

Message: 97509   

 

Hi Mike,

 

Thanks for looking at this.

 

I just droped it in and changed the version in the build file.

 

make[3]: Entering directory `/home/bfredericks/Desktop/blackfin-linux-dist/lib/ffmpeg'

make -C build

make[4]: Entering directory `/home/bfredericks/Desktop/blackfin-linux-dist/lib/ffmpeg/build'

LD    ffmpeg_g

LD    ffserver_g

LD    ffprobe_g

CC    ffplay.o

/home/bfredericks/Desktop/blackfin-linux-dist/lib/ffmpeg/build/../ffmpeg-0.6.1/ffplay.c: In function ‘queue_picture’:

/home/bfredericks/Desktop/blackfin-linux-dist/lib/ffmpeg/build/../ffmpeg-0.6.1/ffplay.c:1436: warning: passing argument 2 of ‘sws_scale’ from incompatible pointer type

/home/bfredericks/Desktop/blackfin-linux-dist/lib/ffmpeg/build/../ffmpeg-0.6.1/ffplay.c: In function ‘main’:

/home/bfredericks/Desktop/blackfin-linux-dist/lib/ffmpeg/build/../ffmpeg-0.6.1/ffplay.c:3157: warning: assignment discards qualifiers from pointer target type

LD    ffplay_g

/opt/uClinux/bfin-linux-uclibc/lib/gcc/bfin-linux-uclibc/4.3.5/../../../../bfin-linux-uclibc/bin/ld: warning: type and size of dynamic symbol `__ROFIXUP_LIST__@@LIBAVCODEC_52' are not defined

/opt/uClinux/bfin-linux-uclibc/lib/gcc/bfin-linux-uclibc/4.3.5/../../../../bfin-linux-uclibc/bin/ld: warning: type and size of dynamic symbol `__ROFIXUP_END__@@LIBAVCODEC_52' are not defined

/opt/uClinux/bfin-linux-uclibc/bfin-linux-uclibc/runtime/usr/lib/crt1.o: In function `__start':

(.text+0x12): warning: relocation references symbol not defined in the module

/opt/uClinux/bfin-linux-uclibc/lib/gcc/bfin-linux-uclibc/4.3.5/../../../../bfin-linux-uclibc/bin/ld: final link failed: Nonrepresentable section on output

collect2: ld returned 1 exit status

make[4]: *** [ffmpeg_g] Error 1

make[4]: *** Waiting for unfinished jobs....

/opt/uClinux/bfin-linux-uclibc/lib/gcc/bfin-linux-uclibc/4.3.5/../../../../bfin-linux-uclibc/bin/ld: warning: type and size of dynamic symbol `__ROFIXUP_LIST__@@LIBAVCODEC_52' are not defined

/opt/uClinux/bfin-linux-uclibc/lib/gcc/bfin-linux-uclibc/4.3.5/../../../../bfin-linux-uclibc/bin/ld: warning: type and size of dynamic symbol `__ROFIXUP_END__@@LIBAVCODEC_52' are not defined

/opt/uClinux/bfin-linux-uclibc/bfin-linux-uclibc/runtime/usr/lib/crt1.o: In function `__start':

(.text+0x12): warning: relocation references symbol not defined in the module

/opt/uClinux/bfin-linux-uclibc/lib/gcc/bfin-linux-uclibc/4.3.5/../../../../bfin-linux-uclibc/bin/ld: final link failed: Nonrepresentable section on output

collect2: ld returned 1 exit status

make[4]: *** [ffprobe_g] Error 1

/opt/uClinux/bfin-linux-uclibc/lib/gcc/bfin-linux-uclibc/4.3.5/../../../../bfin-linux-uclibc/bin/ld: warning: type and size of dynamic symbol `__ROFIXUP_LIST__@@LIBAVCODEC_52' are not defined

/opt/uClinux/bfin-linux-uclibc/lib/gcc/bfin-linux-uclibc/4.3.5/../../../../bfin-linux-uclibc/bin/ld: warning: type and size of dynamic symbol `__ROFIXUP_END__@@LIBAVCODEC_52' are not defined

/opt/uClinux/bfin-linux-uclibc/bfin-linux-uclibc/runtime/usr/lib/crt1.o: In function `__start':

(.text+0x12): warning: relocation references symbol not defined in the module

/opt/uClinux/bfin-linux-uclibc/lib/gcc/bfin-linux-uclibc/4.3.5/../../../../bfin-linux-uclibc/bin/ld: final link failed: Nonrepresentable section on output

collect2: ld returned 1 exit status

make[4]: *** [ffserver_g] Error 1

/opt/uClinux/bfin-linux-uclibc/lib/gcc/bfin-linux-uclibc/4.3.5/../../../../bfin-linux-uclibc/bin/ld: warning: type and size of dynamic symbol `__ROFIXUP_LIST__@@LIBAVCODEC_52' are not defined

/opt/uClinux/bfin-linux-uclibc/lib/gcc/bfin-linux-uclibc/4.3.5/../../../../bfin-linux-uclibc/bin/ld: warning: type and size of dynamic symbol `__ROFIXUP_END__@@LIBAVCODEC_52' are not defined

/opt/uClinux/bfin-linux-uclibc/bfin-linux-uclibc/runtime/usr/lib/crt1.o: In function `__start':

(.text+0x12): warning: relocation references symbol not defined in the module

/opt/uClinux/bfin-linux-uclibc/lib/gcc/bfin-linux-uclibc/4.3.5/../../../../bfin-linux-uclibc/bin/ld: final link failed: Nonrepresentable section on output

collect2: ld returned 1 exit status

make[4]: *** [ffplay_g] Error 1

make[4]: Leaving directory `/home/bfredericks/Desktop/blackfin-linux-dist/lib/ffmpeg/build'

make[3]: *** [all] Error 2

make[3]: Leaving directory `/home/bfredericks/Desktop/blackfin-linux-dist/lib/ffmpeg'

make[2]: *** [ffmpeg] Error 2

make[2]: Leaving directory `/home/bfredericks/Desktop/blackfin-linux-dist/lib'

make[1]: *** [all] Error 2

make[1]: Leaving directory `/home/bfredericks/Desktop/blackfin-linux-dist/lib'

make: *** [subdirs] Error 1

[bfredericks@blair blackfin-linux-dist]$

 

 

Best Regards,

 

Blair Fredericks

QuoteReplyEditDelete

 

 

2011-01-18 00:31:57     Re: FFMPEG 0.6.1

Mike Frysinger (UNITED STATES)

Message: 97510   

 

you need to clean out the build first

QuoteReplyEditDelete

 

 

2011-01-19 02:59:27     Re: FFMPEG 0.6.1

Blair Fredericks (CANADA)

Message: 97538   

 

Hi,

 

Hope this helps?

 

/home/bfredericks/Desktop/blackfin-linux-dist/lib/ffmpeg/build/../ffmpeg-0.6.1/libavdevice/v4l2.c: In function ‘v4l2_read_header’:

/home/bfredericks/Desktop/blackfin-linux-dist/lib/ffmpeg/build/../ffmpeg-0.6.1/libavdevice/v4l2.c:586: warning: ‘codec_id’ may be used uninitialized in this function

/home/bfredericks/Desktop/blackfin-linux-dist/lib/ffmpeg/build/../ffmpeg-0.6.1/libavformat/asfdec.c: In function ‘asf_read_header’:

/home/bfredericks/Desktop/blackfin-linux-dist/lib/ffmpeg/build/../ffmpeg-0.6.1/libavformat/asfdec.c:380: warning: ‘AVPaletteControl’ is deprecated

/home/bfredericks/Desktop/blackfin-linux-dist/lib/ffmpeg/build/../ffmpeg-0.6.1/libavformat/avidec.c: In function ‘avi_read_header’:

/home/bfredericks/Desktop/blackfin-linux-dist/lib/ffmpeg/build/../ffmpeg-0.6.1/libavformat/avidec.c:523: warning: ‘AVPaletteControl’ is deprecated

/home/bfredericks/Desktop/blackfin-linux-dist/lib/ffmpeg/build/../ffmpeg-0.6.1/libavformat/aviobuf.c: In function ‘url_fdopen’:

/home/bfredericks/Desktop/blackfin-linux-dist/lib/ffmpeg/build/../ffmpeg-0.6.1/libavformat/aviobuf.c:581: warning: passing argument 6 of ‘init_put_byte’ from incompatible pointer type

/home/bfredericks/Desktop/blackfin-linux-dist/lib/ffmpeg/build/../ffmpeg-0.6.1/libavformat/aviobuf.c:581: warning: passing argument 7 of ‘init_put_byte’ from incompatible pointer type

/home/bfredericks/Desktop/blackfin-linux-dist/lib/ffmpeg/build/../ffmpeg-0.6.1/libavformat/aviobuf.c:581: warning: passing argument 8 of ‘init_put_byte’ from incompatible pointer type

/home/bfredericks/Desktop/blackfin-linux-dist/lib/ffmpeg/build/../ffmpeg-0.6.1/libavformat/idcin.c:90: warning: ‘AVPaletteControl’ is deprecated

/home/bfredericks/Desktop/blackfin-linux-dist/lib/ffmpeg/build/../ffmpeg-0.6.1/libavformat/ipmovie.c:119: warning: ‘AVPaletteControl’ is deprecated

/home/bfredericks/Desktop/blackfin-linux-dist/lib/ffmpeg/build/../ffmpeg-0.6.1/libavformat/metadata.c: In function ‘av_metadata_set2’:

/home/bfredericks/Desktop/blackfin-linux-dist/lib/ffmpeg/build/../ffmpeg-0.6.1/libavformat/metadata.c:72: warning: assignment discards qualifiers from pointer target type

/home/bfredericks/Desktop/blackfin-linux-dist/lib/ffmpeg/build/../ffmpeg-0.6.1/libavformat/metadata.c:76: warning: assignment discards qualifiers from pointer target type

/home/bfredericks/Desktop/blackfin-linux-dist/lib/ffmpeg/build/../ffmpeg-0.6.1/libavformat/metadata_compat.c: In function ‘ff_metadata_mux_compat’:

/home/bfredericks/Desktop/blackfin-linux-dist/lib/ffmpeg/build/../ffmpeg-0.6.1/libavformat/metadata_compat.c:132: warning: the address of ‘number’ will always evaluate as ‘true’

/home/bfredericks/Desktop/blackfin-linux-dist/lib/ffmpeg/build/../ffmpeg-0.6.1/libavformat/metadata_compat.c:133: warning: the address of ‘number’ will always evaluate as ‘true’

/home/bfredericks/Desktop/blackfin-linux-dist/lib/ffmpeg/build/../ffmpeg-0.6.1/libavformat/mpegenc.c: In function ‘flush_packet’:

/home/bfredericks/Desktop/blackfin-linux-dist/lib/ffmpeg/build/../ffmpeg-0.6.1/libavformat/mpegenc.c:924: warning: passing argument 4 of ‘av_fifo_generic_read’ from incompatible pointer type

/home/bfredericks/Desktop/blackfin-linux-dist/lib/ffmpeg/build/../ffmpeg-0.6.1/libavformat/nutdec.c: In function ‘get_packetheader’:

/home/bfredericks/Desktop/blackfin-linux-dist/lib/ffmpeg/build/../ffmpeg-0.6.1/libavformat/nutdec.c:98: warning: passing argument 2 of ‘ff_crc04C11DB7_update’ from incompatible pointer type

/home/bfredericks/Desktop/blackfin-linux-dist/lib/ffmpeg/build/../ffmpeg-0.6.1/libavformat/nutdec.c: In function ‘decode_main_header’:

/home/bfredericks/Desktop/blackfin-linux-dist/lib/ffmpeg/build/../ffmpeg-0.6.1/libavformat/nutdec.c:276: warning: passing argument 2 of ‘get_buffer’ discards qualifiers from pointer target type

/home/bfredericks/Desktop/blackfin-linux-dist/lib/ffmpeg/build/../ffmpeg-0.6.1/libavformat/nutdec.c: In function ‘nut_read_timestamp’:

/home/bfredericks/Desktop/blackfin-linux-dist/lib/ffmpeg/build/../ffmpeg-0.6.1/libavformat/nutdec.c:844: warning: control reaches end of non-void function

/home/bfredericks/Desktop/blackfin-linux-dist/lib/ffmpeg/build/../ffmpeg-0.6.1/libavformat/rdt.c: In function ‘rdt_parse_packet’:

/home/bfredericks/Desktop/blackfin-linux-dist/lib/ffmpeg/build/../ffmpeg-0.6.1/libavformat/rdt.c:307: warning: passing argument 2 of ‘init_put_byte’ discards qualifiers from pointer target type

/home/bfredericks/Desktop/blackfin-linux-dist/lib/ffmpeg/build/../ffmpeg-0.6.1/libavformat/rmdec.c: In function ‘rm_read_packet’:

/home/bfredericks/Desktop/blackfin-linux-dist/lib/ffmpeg/build/../ffmpeg-0.6.1/libavformat/rmdec.c:842: warning: ‘st’ may be used uninitialized in this function

/home/bfredericks/Desktop/blackfin-linux-dist/lib/ffmpeg/build/../ffmpeg-0.6.1/libavformat/rtmpproto.c: In function ‘get_packet’:

/home/bfredericks/Desktop/blackfin-linux-dist/lib/ffmpeg/build/../ffmpeg-0.6.1/libavformat/rtmpproto.c:753: warning: assignment discards qualifiers from pointer target type

/home/bfredericks/Desktop/blackfin-linux-dist/lib/ffmpeg/build/../ffmpeg-0.6.1/libavformat/rtpdec_asf.c: In function ‘asfrtp_parse_packet’:

/home/bfredericks/Desktop/blackfin-linux-dist/lib/ffmpeg/build/../ffmpeg-0.6.1/libavformat/rtpdec_asf.c:172: warning: passing argument 2 of ‘init_put_byte’ discards qualifiers from pointer target type

/home/bfredericks/Desktop/blackfin-linux-dist/lib/ffmpeg/build/../ffmpeg-0.6.1/libavformat/rtpdec_asf.c:207: warning: passing argument 2 of ‘url_close_dyn_buf’ from incompatible pointer type

/home/bfredericks/Desktop/blackfin-linux-dist/lib/ffmpeg/build/../ffmpeg-0.6.1/libavformat/rtpdec_xiph.c: In function ‘parse_packed_headers’:

/home/bfredericks/Desktop/blackfin-linux-dist/lib/ffmpeg/build/../ffmpeg-0.6.1/libavformat/rtpdec_xiph.c:240: warning: format ‘%d’ expects type ‘int’, but argument 4 has type ‘long int’

/home/bfredericks/Desktop/blackfin-linux-dist/lib/ffmpeg/build/../ffmpeg-0.6.1/libavformat/rtpdec_xiph.c:262: warning: format ‘%d’ expects type ‘int’, but argument 6 has type ‘long int’

/home/bfredericks/Desktop/blackfin-linux-dist/lib/ffmpeg/build/../ffmpeg-0.6.1/libavformat/rtsp.c: In function ‘rtsp_parse_range’:

/home/bfredericks/Desktop/blackfin-linux-dist/lib/ffmpeg/build/../ffmpeg-0.6.1/libavformat/rtsp.c:730: warning: cast discards qualifiers from pointer target type

/home/bfredericks/Desktop/blackfin-linux-dist/lib/ffmpeg/build/../ffmpeg-0.6.1/libavformat/rtsp.c:734: warning: cast discards qualifiers from pointer target type

/home/bfredericks/Desktop/blackfin-linux-dist/lib/ffmpeg/build/../ffmpeg-0.6.1/libavformat/rtsp.c: In function ‘rtsp_parse_transport’:

/home/bfredericks/Desktop/blackfin-linux-dist/lib/ffmpeg/build/../ffmpeg-0.6.1/libavformat/rtsp.c:819: warning: cast discards qualifiers from pointer target type

/home/bfredericks/Desktop/blackfin-linux-dist/lib/ffmpeg/build/../ffmpeg-0.6.1/libavformat/rtsp.c: In function ‘ff_rtsp_send_cmd_with_content_async’:

/home/bfredericks/Desktop/blackfin-linux-dist/lib/ffmpeg/build/../ffmpeg-0.6.1/libavformat/rtsp.c:1037: warning: passing argument 2 of ‘url_write’ discards qualifiers from pointer target type

/home/bfredericks/Desktop/blackfin-linux-dist/lib/ffmpeg/build/../ffmpeg-0.6.1/libavformat/rtsp.c: In function ‘rtsp_fetch_packet’:

/home/bfredericks/Desktop/blackfin-linux-dist/lib/ffmpeg/build/../ffmpeg-0.6.1/libavformat/rtsp.c:1779: warning: ‘rtsp_st’ may be used uninitialized in this function

/home/bfredericks/Desktop/blackfin-linux-dist/lib/ffmpeg/build/../ffmpeg-0.6.1/libavformat/swfenc.c: In function ‘swf_write_video’:

/home/bfredericks/Desktop/blackfin-linux-dist/lib/ffmpeg/build/../ffmpeg-0.6.1/libavformat/swfenc.c:424: warning: passing argument 4 of ‘av_fifo_generic_read’ from incompatible pointer type

/home/bfredericks/Desktop/blackfin-linux-dist/lib/ffmpeg/build/../ffmpeg-0.6.1/libavformat/utils.c: In function ‘ff_av_destruct_packet_nofree’:

/home/bfredericks/Desktop/blackfin-linux-dist/lib/ffmpeg/build/../ffmpeg-0.6.1/libavformat/utils.c:288: warning: ‘av_destruct_packet_nofree’ is deprecated (declared at /home/bfredericks/Desktop/blackfin-linux-dist/lib/ffmpeg/build/../ffmpeg-0.6.1/libavcodec/avcodec.h:2879)

/home/bfredericks/Desktop/blackfin-linux-dist/lib/ffmpeg/build/../ffmpeg-0.6.1/libavformat/utils.c: In function ‘parse_date’:

/home/bfredericks/Desktop/blackfin-linux-dist/lib/ffmpeg/build/../ffmpeg-0.6.1/libavformat/utils.c:3240: warning: cast discards qualifiers from pointer target type

/home/bfredericks/Desktop/blackfin-linux-dist/lib/ffmpeg/build/../ffmpeg-0.6.1/libavformat/wc3movie.c:71: warning: ‘AVPaletteControl’ is deprecated

/home/bfredericks/Desktop/blackfin-linux-dist/lib/ffmpeg/build/../ffmpeg-0.6.1/libavcodec/aac_adtstoasc_bsf.c: In function ‘aac_adtstoasc_filter’:

/home/bfredericks/Desktop/blackfin-linux-dist/lib/ffmpeg/build/../ffmpeg-0.6.1/libavcodec/aac_adtstoasc_bsf.c:51: warning: cast discards qualifiers from pointer target type

/home/bfredericks/Desktop/blackfin-linux-dist/lib/ffmpeg/build/../ffmpeg-0.6.1/libavcodec/aac_adtstoasc_bsf.c:104: warning: cast discards qualifiers from pointer target type

/home/bfredericks/Desktop/blackfin-linux-dist/lib/ffmpeg/build/../ffmpeg-0.6.1/libavcodec/aaccoder.c: In function ‘quantize_and_encode_band_cost’:

/home/bfredericks/Desktop/blackfin-linux-dist/lib/ffmpeg/build/../ffmpeg-0.6.1/libavcodec/aaccoder.c:138: warning: passing argument 1 of ‘quantize_bands’ from incompatible pointer type

/home/bfredericks/Desktop/blackfin-linux-dist/lib/ffmpeg/build/../ffmpeg-0.6.1/libavcodec/aaccoder.c:146: warning: initialization from incompatible pointer type

/home/bfredericks/Desktop/blackfin-linux-dist/lib/ffmpeg/build/../ffmpeg-0.6.1/libavcodec/aacps.c: In function ‘hybrid_analysis’:

/home/bfredericks/Desktop/blackfin-linux-dist/lib/ffmpeg/build/../ffmpeg-0.6.1/libavcodec/aacps.c:369: warning: passing argument 3 of ‘hybrid4_8_12_cx’ from incompatible pointer type

/home/bfredericks/Desktop/blackfin-linux-dist/lib/ffmpeg/build/../ffmpeg-0.6.1/libavcodec/aacps.c:370: warning: passing argument 3 of ‘hybrid4_8_12_cx’ from incompatible pointer type

/home/bfredericks/Desktop/blackfin-linux-dist/lib/ffmpeg/build/../ffmpeg-0.6.1/libavcodec/aacps.c:371: warning: passing argument 3 of ‘hybrid4_8_12_cx’ from incompatible pointer type

/home/bfredericks/Desktop/blackfin-linux-dist/lib/ffmpeg/build/../ffmpeg-0.6.1/libavcodec/aacps.c:372: warning: passing argument 3 of ‘hybrid4_8_12_cx’ from incompatible pointer type

/home/bfredericks/Desktop/blackfin-linux-dist/lib/ffmpeg/build/../ffmpeg-0.6.1/libavcodec/aacps.c:373: warning: passing argument 3 of ‘hybrid4_8_12_cx’ from incompatible pointer type

/home/bfredericks/Desktop/blackfin-linux-dist/lib/ffmpeg/build/../ffmpeg-0.6.1/libavcodec/aacps.c:381: warning: passing argument 3 of ‘hybrid6_cx’ from incompatible pointer type

/home/bfredericks/Desktop/blackfin-linux-dist/lib/ffmpeg/build/../ffmpeg-0.6.1/libavcodec/aacps.c: In function ‘stereo_processing’:

/home/bfredericks/Desktop/blackfin-linux-dist/lib/ffmpeg/build/../ffmpeg-0.6.1/libavcodec/aacps.c:813: warning: initialization from incompatible pointer type

/home/bfredericks/Desktop/blackfin-linux-dist/lib/ffmpeg/build/../ffmpeg-0.6.1/libavcodec/aacps.c: In function ‘ff_ps_apply’:

/home/bfredericks/Desktop/blackfin-linux-dist/lib/ffmpeg/build/../ffmpeg-0.6.1/libavcodec/aacps.c:986: warning: passing argument 3 of ‘decorrelation’ from incompatible pointer type

/home/bfredericks/Desktop/blackfin-linux-dist/lib/ffmpeg/build/../ffmpeg-0.6.1/libavcodec/aacsbr.c: In function ‘ff_sbr_apply’:

/home/bfredericks/Desktop/blackfin-linux-dist/lib/ffmpeg/build/../ffmpeg-0.6.1/libavcodec/aacsbr.c:1731: warning: passing argument 4 of ‘sbr_lf_gen’ from incompatible pointer type

/home/bfredericks/Desktop/blackfin-linux-dist/lib/ffmpeg/build/../ffmpeg-0.6.1/libavcodec/aacsbr.c:1733: warning: passing argument 3 of ‘sbr_hf_inverse_filter’ from incompatible pointer type

/home/bfredericks/Desktop/blackfin-linux-dist/lib/ffmpeg/build/../ffmpeg-0.6.1/libavcodec/aacsbr.c:1737: warning: passing argument 4 of ‘sbr_hf_gen’ from incompatible pointer type

/home/bfredericks/Desktop/blackfin-linux-dist/lib/ffmpeg/build/../ffmpeg-0.6.1/libavcodec/aacsbr.c:1737: warning: passing argument 5 of ‘sbr_hf_gen’ from incompatible pointer type

/home/bfredericks/Desktop/blackfin-linux-dist/lib/ffmpeg/build/../ffmpeg-0.6.1/libavcodec/aacsbr.c:1737: warning: passing argument 6 of ‘sbr_hf_gen’ from incompatible pointer type

/home/bfredericks/Desktop/blackfin-linux-dist/lib/ffmpeg/build/../ffmpeg-0.6.1/libavcodec/aacsbr.c:1744: warning: passing argument 2 of ‘sbr_hf_assemble’ from incompatible pointer type

/home/bfredericks/Desktop/blackfin-linux-dist/lib/ffmpeg/build/../ffmpeg-0.6.1/libavcodec/aacsbr.c:1748: warning: passing argument 3 of ‘sbr_x_gen’ from incompatible pointer type

/home/bfredericks/Desktop/blackfin-linux-dist/lib/ffmpeg/build/../ffmpeg-0.6.1/libavcodec/aacsbr.c:1748: warning: passing argument 4 of ‘sbr_x_gen’ from incompatible pointer type

/home/bfredericks/Desktop/blackfin-linux-dist/lib/ffmpeg/build/../ffmpeg-0.6.1/libavcodec/acelp_pitch_delay.c: In function ‘ff_acelp_decode_gain_code’:

/home/bfredericks/Desktop/blackfin-linux-dist/lib/ffmpeg/build/../ffmpeg-0.6.1/libavcodec/acelp_pitch_delay.c:118: warning: passing argument 1 of ‘dsp->scalarproduct_int16’ discards qualifiers from pointer target type

/home/bfredericks/Desktop/blackfin-linux-dist/lib/ffmpeg/build/../ffmpeg-0.6.1/libavcodec/acelp_pitch_delay.c:118: warning: passing argument 2 of ‘dsp->scalarproduct_int16’ discards qualifiers from pointer target type

/home/bfredericks/Desktop/blackfin-linux-dist/lib/ffmpeg/build/../ffmpeg-0.6.1/libavcodec/avpacket.c: In function ‘av_dup_packet’:

/home/bfredericks/Desktop/blackfin-linux-dist/lib/ffmpeg/build/../ffmpeg-0.6.1/libavcodec/avpacket.c:76: warning: ‘av_destruct_packet_nofree’ is deprecated (declared at /home/bfredericks/Desktop/blackfin-linux-dist/lib/ffmpeg/build/../ffmpeg-0.6.1/libavcodec/avpacket.c:26)

/home/bfredericks/Desktop/blackfin-linux-dist/lib/ffmpeg/build/../ffmpeg-0.6.1/libavcodec/avs.c: In function ‘avs_decode_frame’:

/home/bfredericks/Desktop/blackfin-linux-dist/lib/ffmpeg/build/../ffmpeg-0.6.1/libavcodec/avs.c:59: warning: ‘change_map.buffer’ may be used uninitialized in this function

/home/bfredericks/Desktop/blackfin-linux-dist/lib/ffmpeg/build/../ffmpeg-0.6.1/libavcodec/bitstream_filter.c: In function ‘av_bitstream_filter_filter’:

/home/bfredericks/Desktop/blackfin-linux-dist/lib/ffmpeg/build/../ffmpeg-0.6.1/libavcodec/bitstream_filter.c:62: warning: cast discards qualifiers from pointer target type

/home/bfredericks/Desktop/blackfin-linux-dist/lib/ffmpeg/build/../ffmpeg-0.6.1/libavcodec/bmp.c: In function ‘bmp_decode_frame’:

/home/bfredericks/Desktop/blackfin-linux-dist/lib/ffmpeg/build/../ffmpeg-0.6.1/libavcodec/bmp.c:51: warning: ‘rgb[0]’ may be used uninitialized in this function

/home/bfredericks/Desktop/blackfin-linux-dist/lib/ffmpeg/build/../ffmpeg-0.6.1/libavcodec/bmp.c:51: warning: ‘rgb[1]’ may be used uninitialized in this function

/home/bfredericks/Desktop/blackfin-linux-dist/lib/ffmpeg/build/../ffmpeg-0.6.1/libavcodec/bmp.c:51: warning: ‘rgb[2]’ may be used uninitialized in this function

/home/bfredericks/Desktop/blackfin-linux-dist/lib/ffmpeg/build/../ffmpeg-0.6.1/libavcodec/dv.c: In function ‘dvvideo_decode_frame’:

/home/bfredericks/Desktop/blackfin-linux-dist/lib/ffmpeg/build/../ffmpeg-0.6.1/libavcodec/dv.c:1107: warning: assignment discards qualifiers from pointer target type

/home/bfredericks/Desktop/blackfin-linux-dist/lib/ffmpeg/build/../ffmpeg-0.6.1/libavcodec/h264.h:1256: warning: ‘decode_mb_skip’ defined but not used

/home/bfredericks/Desktop/blackfin-linux-dist/lib/ffmpeg/build/../ffmpeg-0.6.1/libavcodec/flashsv.c: In function ‘flashsv_decode_frame’:

/home/bfredericks/Desktop/blackfin-linux-dist/lib/ffmpeg/build/../ffmpeg-0.6.1/libavcodec/flashsv.c:202: warning: assignment discards qualifiers from pointer target type

/home/bfredericks/Desktop/blackfin-linux-dist/lib/ffmpeg/build/../ffmpeg-0.6.1/libavcodec/h264.c: In function ‘fill_filter_caches’:

/home/bfredericks/Desktop/blackfin-linux-dist/lib/ffmpeg/build/../ffmpeg-0.6.1/libavcodec/h264.c:2309: warning: initialization from incompatible pointer type

/home/bfredericks/Desktop/blackfin-linux-dist/lib/ffmpeg/build/../ffmpeg-0.6.1/libavcodec/h264.c:2386: warning: initialization from incompatible pointer type

/home/bfredericks/Desktop/blackfin-linux-dist/lib/ffmpeg/build/../ffmpeg-0.6.1/libavcodec/h264.c:2401: warning: initialization from incompatible pointer type

/home/bfredericks/Desktop/blackfin-linux-dist/lib/ffmpeg/build/../ffmpeg-0.6.1/libavcodec/h264.c: At top level:

/home/bfredericks/Desktop/blackfin-linux-dist/lib/ffmpeg/build/../ffmpeg-0.6.1/libavcodec/h264.h:1256: warning: ‘decode_mb_skip’ defined but not used

/home/bfredericks/Desktop/blackfin-linux-dist/lib/ffmpeg/build/../ffmpeg-0.6.1/libavcodec/h264.c: In function ‘decode_nal_units’:

/home/bfredericks/Desktop/blackfin-linux-dist/lib/ffmpeg/build/../ffmpeg-0.6.1/libavcodec/h264.c:2704: warning: array subscript is below array bounds

/home/bfredericks/Desktop/blackfin-linux-dist/lib/ffmpeg/build/../ffmpeg-0.6.1/libavcodec/h264_cavlc.c: In function ‘decode_residual’:

/home/bfredericks/Desktop/blackfin-linux-dist/lib/ffmpeg/build/../ffmpeg-0.6.1/libavcodec/h264_cavlc.c:411: warning: suggest parentheses around comparison in operand of &

/home/bfredericks/Desktop/blackfin-linux-dist/lib/ffmpeg/build/../ffmpeg-0.6.1/libavcodec/h264_loopfilter.c: In function ‘check_mv’:

/home/bfredericks/Desktop/blackfin-linux-dist/lib/ffmpeg/build/../ffmpeg-0.6.1/libavcodec/h264_loopfilter.c:427: warning: suggest parentheses around comparison in operand of |

/home/bfredericks/Desktop/blackfin-linux-dist/lib/ffmpeg/build/../ffmpeg-0.6.1/libavcodec/h264_loopfilter.c:432: warning: suggest parentheses around comparison in operand of |

/home/bfredericks/Desktop/blackfin-linux-dist/lib/ffmpeg/build/../ffmpeg-0.6.1/libavcodec/h264_loopfilter.c:433: warning: suggest parentheses around comparison in operand of |

/home/bfredericks/Desktop/blackfin-linux-dist/lib/ffmpeg/build/../ffmpeg-0.6.1/libavcodec/h264_loopfilter.c:437: warning: suggest parentheses around comparison in operand of |

/home/bfredericks/Desktop/blackfin-linux-dist/lib/ffmpeg/build/../ffmpeg-0.6.1/libavcodec/h264_loopfilter.c:441: warning: suggest parentheses around comparison in operand of |

/home/bfredericks/Desktop/blackfin-linux-dist/lib/ffmpeg/build/../ffmpeg-0.6.1/libavcodec/h264_loopfilter.c:442: warning: suggest parentheses around comparison in operand of |

/home/bfredericks/Desktop/blackfin-linux-dist/lib/ffmpeg/build/../ffmpeg-0.6.1/libavcodec/h264_loopfilter.c:443: warning: suggest parentheses around comparison in operand of |

/home/bfredericks/Desktop/blackfin-linux-dist/lib/ffmpeg/build/../ffmpeg-0.6.1/libavcodec/h264_loopfilter.c: At top level:

/home/bfredericks/Desktop/blackfin-linux-dist/lib/ffmpeg/build/../ffmpeg-0.6.1/libavcodec/h264.h:1256: warning: ‘decode_mb_skip’ defined but not used

/home/bfredericks/Desktop/blackfin-linux-dist/lib/ffmpeg/build/../ffmpeg-0.6.1/libavcodec/h264_direct.c: In function ‘pred_spatial_direct_motion’:

/home/bfredericks/Desktop/blackfin-linux-dist/lib/ffmpeg/build/../ffmpeg-0.6.1/libavcodec/h264_direct.c:263: warning: assignment from incompatible pointer type

/home/bfredericks/Desktop/blackfin-linux-dist/lib/ffmpeg/build/../ffmpeg-0.6.1/libavcodec/h264_direct.c:264: warning: assignment from incompatible pointer type

/home/bfredericks/Desktop/blackfin-linux-dist/lib/ffmpeg/build/../ffmpeg-0.6.1/libavcodec/h264_direct.c: In function ‘pred_temp_direct_motion’:

/home/bfredericks/Desktop/blackfin-linux-dist/lib/ffmpeg/build/../ffmpeg-0.6.1/libavcodec/h264_direct.c:443: warning: assignment from incompatible pointer type

/home/bfredericks/Desktop/blackfin-linux-dist/lib/ffmpeg/build/../ffmpeg-0.6.1/libavcodec/h264_direct.c:444: warning: assignment from incompatible pointer type

/home/bfredericks/Desktop/blackfin-linux-dist/lib/ffmpeg/build/../ffmpeg-0.6.1/libavcodec/h264_direct.c: At top level:

/home/bfredericks/Desktop/blackfin-linux-dist/lib/ffmpeg/build/../ffmpeg-0.6.1/libavcodec/h264.h:1256: warning: ‘decode_mb_skip’ defined but not used

/home/bfredericks/Desktop/blackfin-linux-dist/lib/ffmpeg/build/../ffmpeg-0.6.1/libavcodec/h264.h:1256: warning: ‘decode_mb_skip’ defined but not used

/home/bfredericks/Desktop/blackfin-linux-dist/lib/ffmpeg/build/../ffmpeg-0.6.1/libavcodec/h264_mp4toannexb_bsf.c: In function ‘h264_mp4toannexb_filter’:

/home/bfredericks/Desktop/blackfin-linux-dist/lib/ffmpeg/build/../ffmpeg-0.6.1/libavcodec/h264_mp4toannexb_bsf.c:64: warning: cast discards qualifiers from pointer target type

/home/bfredericks/Desktop/blackfin-linux-dist/lib/ffmpeg/build/../ffmpeg-0.6.1/libavcodec/h264.h:1256: warning: ‘decode_mb_skip’ defined but not used

/home/bfredericks/Desktop/blackfin-linux-dist/lib/ffmpeg/build/../ffmpeg-0.6.1/libavcodec/h264.h:1256: warning: ‘decode_mb_skip’ defined but not used

/home/bfredericks/Desktop/blackfin-linux-dist/lib/ffmpeg/build/../ffmpeg-0.6.1/libavcodec/h264.h:1256: warning: ‘decode_mb_skip’ defined but not used

/home/bfredericks/Desktop/blackfin-linux-dist/lib/ffmpeg/build/../ffmpeg-0.6.1/libavcodec/idcinvideo.c: In function ‘idcin_decode_frame’:

/home/bfredericks/Desktop/blackfin-linux-dist/lib/ffmpeg/build/../ffmpeg-0.6.1/libavcodec/idcinvideo.c:216: warning: ‘AVPaletteControl’ is deprecated

/home/bfredericks/Desktop/blackfin-linux-dist/lib/ffmpeg/build/../ffmpeg-0.6.1/libavcodec/interplayvideo.c: In function ‘ipvideo_decode_frame’:

/home/bfredericks/Desktop/blackfin-linux-dist/lib/ffmpeg/build/../ffmpeg-0.6.1/libavcodec/interplayvideo.c:1045: warning: ‘AVPaletteControl’ is deprecated

/home/bfredericks/Desktop/blackfin-linux-dist/lib/ffmpeg/build/../ffmpeg-0.6.1/libavcodec/ivi_common.c: In function ‘ff_ivi_decode_blocks’:

/home/bfredericks/Desktop/blackfin-linux-dist/lib/ffmpeg/build/../ffmpeg-0.6.1/libavcodec/ivi_common.c:336: warning: ‘sym’ may be used uninitialized in this function

/home/bfredericks/Desktop/blackfin-linux-dist/lib/ffmpeg/build/../ffmpeg-0.6.1/libavcodec/ivi_common.c:333: warning: ‘mv_y’ may be used uninitialized in this function

/home/bfredericks/Desktop/blackfin-linux-dist/lib/ffmpeg/build/../ffmpeg-0.6.1/libavcodec/ivi_common.c:333: warning: ‘mv_x’ may be used uninitialized in this function

/home/bfredericks/Desktop/blackfin-linux-dist/lib/ffmpeg/build/../ffmpeg-0.6.1/libavcodec/ivi_common.c:333: warning: ‘mc_type’ may be used uninitialized in this function

/home/bfredericks/Desktop/blackfin-linux-dist/lib/ffmpeg/build/../ffmpeg-0.6.1/libavcodec/ivi_dsp.c: In function ‘ff_ivi_recompose53’:

/home/bfredericks/Desktop/blackfin-linux-dist/lib/ffmpeg/build/../ffmpeg-0.6.1/libavcodec/ivi_dsp.c:41: warning: ‘b3_9’ may be used uninitialized in this function

/home/bfredericks/Desktop/blackfin-linux-dist/lib/ffmpeg/build/../ffmpeg-0.6.1/libavcodec/ivi_dsp.c:41: warning: ‘b3_8’ may be used uninitialized in this function

/home/bfredericks/Desktop/blackfin-linux-dist/lib/ffmpeg/build/../ffmpeg-0.6.1/libavcodec/ivi_dsp.c:41: warning: ‘b3_6’ may be used uninitialized in this function

/home/bfredericks/Desktop/blackfin-linux-dist/lib/ffmpeg/build/../ffmpeg-0.6.1/libavcodec/ivi_dsp.c:41: warning: ‘b3_5’ may be used uninitialized in this function

/home/bfredericks/Desktop/blackfin-linux-dist/lib/ffmpeg/build/../ffmpeg-0.6.1/libavcodec/ivi_dsp.c:41: warning: ‘b3_3’ may be used uninitialized in this function

/home/bfredericks/Desktop/blackfin-linux-dist/lib/ffmpeg/build/../ffmpeg-0.6.1/libavcodec/ivi_dsp.c:41: warning: ‘b3_2’ may be used uninitialized in this function

/home/bfredericks/Desktop/blackfin-linux-dist/lib/ffmpeg/build/../ffmpeg-0.6.1/libavcodec/ivi_dsp.c:40: warning: ‘b2_6’ may be used uninitialized in this function

/home/bfredericks/Desktop/blackfin-linux-dist/lib/ffmpeg/build/../ffmpeg-0.6.1/libavcodec/ivi_dsp.c:40: warning: ‘b2_5’ may be used uninitialized in this function

/home/bfredericks/Desktop/blackfin-linux-dist/lib/ffmpeg/build/../ffmpeg-0.6.1/libavcodec/ivi_dsp.c:40: warning: ‘b2_3’ may be used uninitialized in this function

/home/bfredericks/Desktop/blackfin-linux-dist/lib/ffmpeg/build/../ffmpeg-0.6.1/libavcodec/ivi_dsp.c:40: warning: ‘b2_2’ may be used uninitialized in this function

/home/bfredericks/Desktop/blackfin-linux-dist/lib/ffmpeg/build/../ffmpeg-0.6.1/libavcodec/ivi_dsp.c:40: warning: ‘b1_3’ may be used uninitialized in this function

/home/bfredericks/Desktop/blackfin-linux-dist/lib/ffmpeg/build/../ffmpeg-0.6.1/libavcodec/ivi_dsp.c:40: warning: ‘b1_2’ may be used uninitialized in this function

/home/bfredericks/Desktop/blackfin-linux-dist/lib/ffmpeg/build/../ffmpeg-0.6.1/libavcodec/ivi_dsp.c:40: warning: ‘b1_1’ may be used uninitialized in this function

/home/bfredericks/Desktop/blackfin-linux-dist/lib/ffmpeg/build/../ffmpeg-0.6.1/libavcodec/ivi_dsp.c:40: warning: ‘b0_2’ may be used uninitialized in this function

/home/bfredericks/Desktop/blackfin-linux-dist/lib/ffmpeg/build/../ffmpeg-0.6.1/libavcodec/ivi_dsp.c:40: warning: ‘b0_1’ may be used uninitialized in this function

/home/bfredericks/Desktop/blackfin-linux-dist/lib/ffmpeg/build/../ffmpeg-0.6.1/libavcodec/lcldec.c: In function ‘zlib_decomp’:

/home/bfredericks/Desktop/blackfin-linux-dist/lib/ffmpeg/build/../ffmpeg-0.6.1/libavcodec/lcldec.c:136: warning: assignment discards qualifiers from pointer target type

/home/bfredericks/Desktop/blackfin-linux-dist/lib/ffmpeg/build/../ffmpeg-0.6.1/libavcodec/lcldec.c: In function ‘decode_frame’:

/home/bfredericks/Desktop/blackfin-linux-dist/lib/ffmpeg/build/../ffmpeg-0.6.1/libavcodec/lcldec.c:165: warning: cast discards qualifiers from pointer target type

/home/bfredericks/Desktop/blackfin-linux-dist/lib/ffmpeg/build/../ffmpeg-0.6.1/libavcodec/motion_est.c: In function ‘bidir_refine’:

/home/bfredericks/Desktop/blackfin-linux-dist/lib/ffmpeg/build/../ffmpeg-0.6.1/libavcodec/motion_est.c:1515: warning: large integer implicitly truncated to unsigned type

/home/bfredericks/Desktop/blackfin-linux-dist/lib/ffmpeg/build/../ffmpeg-0.6.1/libavcodec/motion_est.c:1516: warning: large integer implicitly truncated to unsigned type

/home/bfredericks/Desktop/blackfin-linux-dist/lib/ffmpeg/build/../ffmpeg-0.6.1/libavcodec/motion_est.c:1520: warning: large integer implicitly truncated to unsigned type

/home/bfredericks/Desktop/blackfin-linux-dist/lib/ffmpeg/build/../ffmpeg-0.6.1/libavcodec/motion_est.c:1520: warning: large integer implicitly truncated to unsigned type

/home/bfredericks/Desktop/blackfin-linux-dist/lib/ffmpeg/build/../ffmpeg-0.6.1/libavcodec/motion_est.c:1520: warning: large integer implicitly truncated to unsigned type

/home/bfredericks/Desktop/blackfin-linux-dist/lib/ffmpeg/build/../ffmpeg-0.6.1/libavcodec/motion_est.c:1521: warning: large integer implicitly truncated to unsigned type

/home/bfredericks/Desktop/blackfin-linux-dist/lib/ffmpeg/build/../ffmpeg-0.6.1/libavcodec/motion_est.c:1522: warning: large integer implicitly truncated to unsigned type

/home/bfredericks/Desktop/blackfin-linux-dist/lib/ffmpeg/build/../ffmpeg-0.6.1/libavcodec/motion_est.c:1523: warning: large integer implicitly truncated to unsigned type

/home/bfredericks/Desktop/blackfin-linux-dist/lib/ffmpeg/build/../ffmpeg-0.6.1/libavcodec/motion_est.c:1525: warning: large integer implicitly truncated to unsigned type

/home/bfredericks/Desktop/blackfin-linux-dist/lib/ffmpeg/build/../ffmpeg-0.6.1/libavcodec/motion_est.c:1526: warning: large integer implicitly truncated to unsigned type

/home/bfredericks/Desktop/blackfin-linux-dist/lib/ffmpeg/build/../ffmpeg-0.6.1/libavcodec/motion_est.c:1526: warning: large integer implicitly truncated to unsigned type

/home/bfredericks/Desktop/blackfin-linux-dist/lib/ffmpeg/build/../ffmpeg-0.6.1/libavcodec/motion_est.c:1527: warning: large integer implicitly truncated to unsigned type

/home/bfredericks/Desktop/blackfin-linux-dist/lib/ffmpeg/build/../ffmpeg-0.6.1/libavcodec/mp3_header_compress_bsf.c: In function ‘mp3_header_compress’:

/home/bfredericks/Desktop/blackfin-linux-dist/lib/ffmpeg/build/../ffmpeg-0.6.1/libavcodec/mp3_header_compress_bsf.c:41: warning: cast discards qualifiers from pointer target type

/home/bfredericks/Desktop/blackfin-linux-dist/lib/ffmpeg/build/../ffmpeg-0.6.1/libavcodec/mp3_header_decompress_bsf.c: In function ‘mp3_header_decompress’:

/home/bfredericks/Desktop/blackfin-linux-dist/lib/ffmpeg/build/../ffmpeg-0.6.1/libavcodec/mp3_header_decompress_bsf.c:36: warning: cast discards qualifiers from pointer target type

/home/bfredericks/Desktop/blackfin-linux-dist/lib/ffmpeg/build/../ffmpeg-0.6.1/libavcodec/nuv.c: In function ‘copy_frame’:

/home/bfredericks/Desktop/blackfin-linux-dist/lib/ffmpeg/build/../ffmpeg-0.6.1/libavcodec/nuv.c:74: warning: passing argument 2 of ‘avpicture_fill’ discards qualifiers from pointer target type

/home/bfredericks/Desktop/blackfin-linux-dist/lib/ffmpeg/build/../ffmpeg-0.6.1/libavcodec/parser.c: In function ‘av_parser_change’:

/home/bfredericks/Desktop/blackfin-linux-dist/lib/ffmpeg/build/../ffmpeg-0.6.1/libavcodec/parser.c:214: warning: cast discards qualifiers from pointer target type

/home/bfredericks/Desktop/blackfin-linux-dist/lib/ffmpeg/build/../ffmpeg-0.6.1/libavcodec/pngdec.c: In function ‘png_decode_idat’:

/home/bfredericks/Desktop/blackfin-linux-dist/lib/ffmpeg/build/../ffmpeg-0.6.1/libavcodec/pngdec.c:365: warning: assignment discards qualifiers from pointer target type

/home/bfredericks/Desktop/blackfin-linux-dist/lib/ffmpeg/build/../ffmpeg-0.6.1/libavcodec/pngenc.c: In function ‘png_write_row’:

/home/bfredericks/Desktop/blackfin-linux-dist/lib/ffmpeg/build/../ffmpeg-0.6.1/libavcodec/pngenc.c:217: warning: cast discards qualifiers from pointer target type

/home/bfredericks/Desktop/blackfin-linux-dist/lib/ffmpeg/build/../ffmpeg-0.6.1/libavcodec/pnm_parser.c: In function ‘pnm_parse’:

/home/bfredericks/Desktop/blackfin-linux-dist/lib/ffmpeg/build/../ffmpeg-0.6.1/libavcodec/pnm_parser.c:44: warning: cast discards qualifiers from pointer target type

/home/bfredericks/Desktop/blackfin-linux-dist/lib/ffmpeg/build/../ffmpeg-0.6.1/libavcodec/pnm_parser.c:45: warning: cast discards qualifiers from pointer target type

/home/bfredericks/Desktop/blackfin-linux-dist/lib/ffmpeg/build/../ffmpeg-0.6.1/libavcodec/pnmdec.c: In function ‘pnm_decode_frame’:

/home/bfredericks/Desktop/blackfin-linux-dist/lib/ffmpeg/build/../ffmpeg-0.6.1/libavcodec/pnmdec.c:41: warning: assignment discards qualifiers from pointer target type

/home/bfredericks/Desktop/blackfin-linux-dist/lib/ffmpeg/build/../ffmpeg-0.6.1/libavcodec/pnmdec.c:42: warning: assignment discards qualifiers from pointer target type

/home/bfredericks/Desktop/blackfin-linux-dist/lib/ffmpeg/build/../ffmpeg-0.6.1/libavcodec/rangecoder.c: In function ‘ff_init_range_decoder’:

/home/bfredericks/Desktop/blackfin-linux-dist/lib/ffmpeg/build/../ffmpeg-0.6.1/libavcodec/rangecoder.c:54: warning: cast discards qualifiers from pointer target type

/home/bfredericks/Desktop/blackfin-linux-dist/lib/ffmpeg/build/../ffmpeg-0.6.1/libavcodec/rangecoder.c:56: warning: passing argument 1 of ‘bytestream_get_be16’ from incompatible pointer type

/home/bfredericks/Desktop/blackfin-linux-dist/lib/ffmpeg/build/../ffmpeg-0.6.1/libavcodec/rawdec.c: In function ‘raw_decode’:

/home/bfredericks/Desktop/blackfin-linux-dist/lib/ffmpeg/build/../ffmpeg-0.6.1/libavcodec/rawdec.c:147: warning: passing argument 2 of ‘avpicture_fill’ discards qualifiers from pointer target type

/home/bfredericks/Desktop/blackfin-linux-dist/lib/ffmpeg/build/../ffmpeg-0.6.1/libavcodec/remove_extradata_bsf.c: In function ‘remove_extradata’:

/home/bfredericks/Desktop/blackfin-linux-dist/lib/ffmpeg/build/../ffmpeg-0.6.1/libavcodec/remove_extradata_bsf.c:45: warning: cast discards qualifiers from pointer target type

/home/bfredericks/Desktop/blackfin-linux-dist/lib/ffmpeg/build/../ffmpeg-0.6.1/libavcodec/rv34.c: In function ‘rv34_set_deblock_coef’:

/home/bfredericks/Desktop/blackfin-linux-dist/lib/ffmpeg/build/../ffmpeg-0.6.1/libavcodec/rv34.c:1145: warning: initialization from incompatible pointer type

/home/bfredericks/Desktop/blackfin-linux-dist/lib/ffmpeg/build/../ffmpeg-0.6.1/libavcodec/svq1dec.c: In function ‘svq1_decode_frame’:

/home/bfredericks/Desktop/blackfin-linux-dist/lib/ffmpeg/build/../ffmpeg-0.6.1/libavcodec/svq1dec.c:665: warning: cast discards qualifiers from pointer target type

/home/bfredericks/Desktop/blackfin-linux-dist/lib/ffmpeg/build/../ffmpeg-0.6.1/libavcodec/svq1dec.c:349: warning: ‘mv.x’ may be used uninitialized in this function

/home/bfredericks/Desktop/blackfin-linux-dist/lib/ffmpeg/build/../ffmpeg-0.6.1/libavcodec/svq1dec.c:349: note: ‘mv.x’ was declared here

/home/bfredericks/Desktop/blackfin-linux-dist/lib/ffmpeg/build/../ffmpeg-0.6.1/libavcodec/svq3.c: In function ‘svq3_decode_slice_header’:

/home/bfredericks/Desktop/blackfin-linux-dist/lib/ffmpeg/build/../ffmpeg-0.6.1/libavcodec/svq3.c:733: warning: cast discards qualifiers from pointer target type

/home/bfredericks/Desktop/blackfin-linux-dist/lib/ffmpeg/build/../ffmpeg-0.6.1/libavcodec/svq3.c:736: warning: cast discards qualifiers from pointer target type

/home/bfredericks/Desktop/blackfin-linux-dist/lib/ffmpeg/build/../ffmpeg-0.6.1/libavcodec/svq3.c: At top level:

/home/bfredericks/Desktop/blackfin-linux-dist/lib/ffmpeg/build/../ffmpeg-0.6.1/libavcodec/h264.h:1256: warning: ‘decode_mb_skip’ defined but not used

/home/bfredericks/Desktop/blackfin-linux-dist/lib/ffmpeg/build/../ffmpeg-0.6.1/libavcodec/svq1enc.c: In function ‘svq1_write_header’:

/home/bfredericks/Desktop/blackfin-linux-dist/lib/ffmpeg/build/../ffmpeg-0.6.1/libavcodec/svq1enc.c:98: warning: passing argument 1 of ‘ff_match_2uint16’ from incompatible pointer type

/home/bfredericks/Desktop/blackfin-linux-dist/lib/ffmpeg/build/../ffmpeg-0.6.1/libavcodec/tiff.c: In function ‘tiff_uncompress’:

/home/bfredericks/Desktop/blackfin-linux-dist/lib/ffmpeg/build/../ffmpeg-0.6.1/libavcodec/tiff.c:86: warning: assignment discards qualifiers from pointer target type

/home/bfredericks/Desktop/blackfin-linux-dist/lib/ffmpeg/build/../ffmpeg-0.6.1/libavcodec/tscc.c: In function ‘decode_frame’:

/home/bfredericks/Desktop/blackfin-linux-dist/lib/ffmpeg/build/../ffmpeg-0.6.1/libavcodec/tscc.c:97: warning: assignment discards qualifiers from pointer target type

/home/bfredericks/Desktop/blackfin-linux-dist/lib/ffmpeg/build/../ffmpeg-0.6.1/libavcodec/utils.c:463: warning: ‘force_align_arg_pointer’ attribute directive ignored

/home/bfredericks/Desktop/blackfin-linux-dist/lib/ffmpeg/build/../ffmpeg-0.6.1/libavcodec/utils.c:538: warning: ‘force_align_arg_pointer’ attribute directive ignored

/home/bfredericks/Desktop/blackfin-linux-dist/lib/ffmpeg/build/../ffmpeg-0.6.1/libavcodec/utils.c: In function ‘avcodec_encode_audio’:

/home/bfredericks/Desktop/blackfin-linux-dist/lib/ffmpeg/build/../ffmpeg-0.6.1/libavcodec/utils.c:544: warning: passing argument 4 of ‘avctx->codec->encode’ discards qualifiers from pointer target type

/home/bfredericks/Desktop/blackfin-linux-dist/lib/ffmpeg/build/../ffmpeg-0.6.1/libavcodec/utils.c: At top level:

/home/bfredericks/Desktop/blackfin-linux-dist/lib/ffmpeg/build/../ffmpeg-0.6.1/libavcodec/utils.c:553: warning: ‘force_align_arg_pointer’ attribute directive ignored

/home/bfredericks/Desktop/blackfin-linux-dist/lib/ffmpeg/build/../ffmpeg-0.6.1/libavcodec/utils.c: In function ‘avcodec_encode_video’:

/home/bfredericks/Desktop/blackfin-linux-dist/lib/ffmpeg/build/../ffmpeg-0.6.1/libavcodec/utils.c:561: warning: passing argument 4 of ‘avctx->codec->encode’ discards qualifiers from pointer target type

/home/bfredericks/Desktop/blackfin-linux-dist/lib/ffmpeg/build/../ffmpeg-0.6.1/libavcodec/utils.c: In function ‘avcodec_encode_subtitle’:

/home/bfredericks/Desktop/blackfin-linux-dist/lib/ffmpeg/build/../ffmpeg-0.6.1/libavcodec/utils.c:580: warning: passing argument 4 of ‘avctx->codec->encode’ discards qualifiers from pointer target type

/home/bfredericks/Desktop/blackfin-linux-dist/lib/ffmpeg/build/../ffmpeg-0.6.1/libavcodec/utils.c: At top level:

/home/bfredericks/Desktop/blackfin-linux-dist/lib/ffmpeg/build/../ffmpeg-0.6.1/libavcodec/utils.c:589: warning: ‘force_align_arg_pointer’ attribute directive ignored

/home/bfredericks/Desktop/blackfin-linux-dist/lib/ffmpeg/build/../ffmpeg-0.6.1/libavcodec/utils.c: In function ‘avcodec_decode_video’:

/home/bfredericks/Desktop/blackfin-linux-dist/lib/ffmpeg/build/../ffmpeg-0.6.1/libavcodec/utils.c:592: warning: assignment discards qualifiers from pointer target type

/home/bfredericks/Desktop/blackfin-linux-dist/lib/ffmpeg/build/../ffmpeg-0.6.1/libavcodec/utils.c: At top level:

/home/bfredericks/Desktop/blackfin-linux-dist/lib/ffmpeg/build/../ffmpeg-0.6.1/libavcodec/utils.c:604: warning: ‘force_align_arg_pointer’ attribute directive ignored

/home/bfredericks/Desktop/blackfin-linux-dist/lib/ffmpeg/build/../ffmpeg-0.6.1/libavcodec/utils.c:628: warning: ‘force_align_arg_pointer’ attribute directive ignored

/home/bfredericks/Desktop/blackfin-linux-dist/lib/ffmpeg/build/../ffmpeg-0.6.1/libavcodec/utils.c: In function ‘avcodec_decode_audio2’:

/home/bfredericks/Desktop/blackfin-linux-dist/lib/ffmpeg/build/../ffmpeg-0.6.1/libavcodec/utils.c:631: warning: assignment discards qualifiers from pointer target type

/home/bfredericks/Desktop/blackfin-linux-dist/lib/ffmpeg/build/../ffmpeg-0.6.1/libavcodec/utils.c: At top level:

/home/bfredericks/Desktop/blackfin-linux-dist/lib/ffmpeg/build/../ffmpeg-0.6.1/libavcodec/utils.c:641: warning: ‘force_align_arg_pointer’ attribute directive ignored

/home/bfredericks/Desktop/blackfin-linux-dist/lib/ffmpeg/build/../ffmpeg-0.6.1/libavcodec/utils.c: In function ‘avcodec_decode_subtitle’:

/home/bfredericks/Desktop/blackfin-linux-dist/lib/ffmpeg/build/../ffmpeg-0.6.1/libavcodec/utils.c:672: warning: assignment discards qualifiers from pointer target type

/home/bfredericks/Desktop/blackfin-linux-dist/lib/ffmpeg/build/../ffmpeg-0.6.1/libavcodec/utils.c: In function ‘av_parse_video_frame_size’:

/home/bfredericks/Desktop/blackfin-linux-dist/lib/ffmpeg/build/../ffmpeg-0.6.1/libavcodec/utils.c:1179: warning: assignment discards qualifiers from pointer target type

/home/bfredericks/Desktop/blackfin-linux-dist/lib/ffmpeg/build/../ffmpeg-0.6.1/libavcodec/v210dec.c: In function ‘decode_frame’:

/home/bfredericks/Desktop/blackfin-linux-dist/lib/ffmpeg/build/../ffmpeg-0.6.1/libavcodec/v210dec.c:79: warning: ‘val’ may be used uninitialized in this function

/home/bfredericks/Desktop/blackfin-linux-dist/lib/ffmpeg/build/../ffmpeg-0.6.1/libavcodec/v210dec.c:79: note: ‘val’ was declared here

/home/bfredericks/Desktop/blackfin-linux-dist/lib/ffmpeg/build/../ffmpeg-0.6.1/libavcodec/v210enc.c: In function ‘encode_frame’:

/home/bfredericks/Desktop/blackfin-linux-dist/lib/ffmpeg/build/../ffmpeg-0.6.1/libavcodec/v210enc.c:78: warning: ‘val’ may be used uninitialized in this function

/home/bfredericks/Desktop/blackfin-linux-dist/lib/ffmpeg/build/../ffmpeg-0.6.1/libavcodec/v210enc.c:78: note: ‘val’ was declared here

/home/bfredericks/Desktop/blackfin-linux-dist/lib/ffmpeg/build/../ffmpeg-0.6.1/libavcodec/vorbis_dec.c: In function ‘vorbis_parse_setup_hdr_floors’:

/home/bfredericks/Desktop/blackfin-linux-dist/lib/ffmpeg/build/../ffmpeg-0.6.1/libavcodec/vorbis_dec.c:576: warning: ‘book_idx’ may be used uninitialized in this function

/home/bfredericks/Desktop/blackfin-linux-dist/lib/ffmpeg/build/../ffmpeg-0.6.1/libavcodec/wmaenc.c: In function ‘encode_init’:

/home/bfredericks/Desktop/blackfin-linux-dist/lib/ffmpeg/build/../ffmpeg-0.6.1/libavcodec/wmaenc.c:32: warning: ‘extradata’ may be used uninitialized in this function

/home/bfredericks/Desktop/blackfin-linux-dist/lib/ffmpeg/build/../ffmpeg-0.6.1/libavcodec/wmavoice.c: In function ‘synth_block_fcb_acb’:

/home/bfredericks/Desktop/blackfin-linux-dist/lib/ffmpeg/build/../ffmpeg-0.6.1/libavcodec/wmavoice.c:1346: warning: passing argument 1 of ‘av_memcpy_backptr’ from incompatible pointer type

/home/bfredericks/Desktop/blackfin-linux-dist/lib/ffmpeg/build/../ffmpeg-0.6.1/libavcodec/xan.c: In function ‘xan_decode_frame’:

/home/bfredericks/Desktop/blackfin-linux-dist/lib/ffmpeg/build/../ffmpeg-0.6.1/libavcodec/xan.c:364: warning: ‘AVPaletteControl’ is deprecated

/home/bfredericks/Desktop/blackfin-linux-dist/lib/ffmpeg/build/../ffmpeg-0.6.1/libavcodec/zmbv.c: In function ‘decode_frame’:

/home/bfredericks/Desktop/blackfin-linux-dist/lib/ffmpeg/build/../ffmpeg-0.6.1/libavcodec/zmbv.c:497: warning: assignment discards qualifiers from pointer target type

/home/bfredericks/Desktop/blackfin-linux-dist/lib/ffmpeg/build/../ffmpeg-0.6.1/libavutil/aes.c: In function ‘subshift’:

/home/bfredericks/Desktop/blackfin-linux-dist/lib/ffmpeg/build/../ffmpeg-0.6.1/libavutil/aes.c:56: warning: initialization from incompatible pointer type

/home/bfredericks/Desktop/blackfin-linux-dist/lib/ffmpeg/build/../ffmpeg-0.6.1/libavutil/aes.c:57: warning: initialization from incompatible pointer type

/home/bfredericks/Desktop/blackfin-linux-dist/lib/ffmpeg/build/../ffmpeg-0.6.1/libavutil/aes.c: In function ‘crypt’:

/home/bfredericks/Desktop/blackfin-linux-dist/lib/ffmpeg/build/../ffmpeg-0.6.1/libavutil/aes.c:84: warning: passing argument 2 of ‘mix’ from incompatible pointer type

/home/bfredericks/Desktop/blackfin-linux-dist/lib/ffmpeg/build/../ffmpeg-0.6.1/libavutil/aes.c:85: warning: passing argument 1 of ‘addkey’ from incompatible pointer type

/home/bfredericks/Desktop/blackfin-linux-dist/lib/ffmpeg/build/../ffmpeg-0.6.1/libavutil/aes.c:85: warning: passing argument 2 of ‘addkey’ from incompatible pointer type

/home/bfredericks/Desktop/blackfin-linux-dist/lib/ffmpeg/build/../ffmpeg-0.6.1/libavutil/aes.c:85: warning: passing argument 3 of ‘addkey’ from incompatible pointer type

/home/bfredericks/Desktop/blackfin-linux-dist/lib/ffmpeg/build/../ffmpeg-0.6.1/libavutil/aes.c:87: warning: passing argument 1 of ‘subshift’ from incompatible pointer type

/home/bfredericks/Desktop/blackfin-linux-dist/lib/ffmpeg/build/../ffmpeg-0.6.1/libavutil/aes.c: In function ‘av_aes_crypt’:

/home/bfredericks/Desktop/blackfin-linux-dist/lib/ffmpeg/build/../ffmpeg-0.6.1/libavutil/aes.c:92: warning: passing argument 1 of ‘addkey’ from incompatible pointer type

/home/bfredericks/Desktop/blackfin-linux-dist/lib/ffmpeg/build/../ffmpeg-0.6.1/libavutil/aes.c:92: warning: passing argument 2 of ‘addkey’ from incompatible pointer type

/home/bfredericks/Desktop/blackfin-linux-dist/lib/ffmpeg/build/../ffmpeg-0.6.1/libavutil/aes.c:92: warning: passing argument 3 of ‘addkey’ from incompatible pointer type

/home/bfredericks/Desktop/blackfin-linux-dist/lib/ffmpeg/build/../ffmpeg-0.6.1/libavutil/aes.c:94: warning: passing argument 4 of ‘crypt’ from incompatible pointer type

/home/bfredericks/Desktop/blackfin-linux-dist/lib/ffmpeg/build/../ffmpeg-0.6.1/libavutil/aes.c:96: warning: passing argument 1 of ‘addkey’ from incompatible pointer type

/home/bfredericks/Desktop/blackfin-linux-dist/lib/ffmpeg/build/../ffmpeg-0.6.1/libavutil/aes.c:96: warning: passing argument 2 of ‘addkey’ from incompatible pointer type

/home/bfredericks/Desktop/blackfin-linux-dist/lib/ffmpeg/build/../ffmpeg-0.6.1/libavutil/aes.c:96: warning: passing argument 3 of ‘addkey’ from incompatible pointer type

/home/bfredericks/Desktop/blackfin-linux-dist/lib/ffmpeg/build/../ffmpeg-0.6.1/libavutil/aes.c:99: warning: passing argument 1 of ‘addkey’ from incompatible pointer type

/home/bfredericks/Desktop/blackfin-linux-dist/lib/ffmpeg/build/../ffmpeg-0.6.1/libavutil/aes.c:99: warning: passing argument 2 of ‘addkey’ from incompatible pointer type

/home/bfredericks/Desktop/blackfin-linux-dist/lib/ffmpeg/build/../ffmpeg-0.6.1/libavutil/aes.c:99: warning: passing argument 3 of ‘addkey’ from incompatible pointer type

/home/bfredericks/Desktop/blackfin-linux-dist/lib/ffmpeg/build/../ffmpeg-0.6.1/libavutil/aes.c:101: warning: passing argument 1 of ‘addkey’ from incompatible pointer type

/home/bfredericks/Desktop/blackfin-linux-dist/lib/ffmpeg/build/../ffmpeg-0.6.1/libavutil/aes.c:101: warning: passing argument 2 of ‘addkey’ from incompatible pointer type

/home/bfredericks/Desktop/blackfin-linux-dist/lib/ffmpeg/build/../ffmpeg-0.6.1/libavutil/aes.c:101: warning: passing argument 3 of ‘addkey’ from incompatible pointer type

/home/bfredericks/Desktop/blackfin-linux-dist/lib/ffmpeg/build/../ffmpeg-0.6.1/libavutil/aes.c:102: warning: passing argument 4 of ‘crypt’ from incompatible pointer type

/home/bfredericks/Desktop/blackfin-linux-dist/lib/ffmpeg/build/../ffmpeg-0.6.1/libavutil/aes.c:103: warning: passing argument 1 of ‘addkey’ from incompatible pointer type

/home/bfredericks/Desktop/blackfin-linux-dist/lib/ffmpeg/build/../ffmpeg-0.6.1/libavutil/aes.c:103: warning: passing argument 2 of ‘addkey’ from incompatible pointer type

/home/bfredericks/Desktop/blackfin-linux-dist/lib/ffmpeg/build/../ffmpeg-0.6.1/libavutil/aes.c:103: warning: passing argument 3 of ‘addkey’ from incompatible pointer type

/home/bfredericks/Desktop/blackfin-linux-dist/lib/ffmpeg/build/../ffmpeg-0.6.1/libavutil/aes.c: In function ‘av_aes_init’:

/home/bfredericks/Desktop/blackfin-linux-dist/lib/ffmpeg/build/../ffmpeg-0.6.1/libavutil/aes.c:149: warning: passing argument 1 of ‘init_multbl2’ from incompatible pointer type

/home/bfredericks/Desktop/blackfin-linux-dist/lib/ffmpeg/build/../ffmpeg-0.6.1/libavutil/aes.c:150: warning: passing argument 1 of ‘init_multbl2’ from incompatible pointer type

/home/bfredericks/Desktop/blackfin-linux-dist/lib/ffmpeg/build/../ffmpeg-0.6.1/libavutil/aes.c:180: warning: passing argument 1 of ‘subshift’ from incompatible pointer type

/home/bfredericks/Desktop/blackfin-linux-dist/lib/ffmpeg/build/../ffmpeg-0.6.1/libavutil/aes.c:181: warning: passing argument 1 of ‘mix’ from incompatible pointer type

/home/bfredericks/Desktop/blackfin-linux-dist/lib/ffmpeg/build/../ffmpeg-0.6.1/libavutil/aes.c:133: warning: array subscript is above array bounds

/home/bfredericks/Desktop/blackfin-linux-dist/lib/ffmpeg/build/../ffmpeg-0.6.1/libavutil/avstring.c: In function ‘av_stristr’:

/home/bfredericks/Desktop/blackfin-linux-dist/lib/ffmpeg/build/../ffmpeg-0.6.1/libavutil/avstring.c:54: warning: return discards qualifiers from pointer target type

/home/bfredericks/Desktop/blackfin-linux-dist/lib/ffmpeg/build/../ffmpeg-0.6.1/libavutil/avstring.c:58: warning: return discards qualifiers from pointer target type

/home/bfredericks/Desktop/blackfin-linux-dist/lib/ffmpeg/build/../ffmpeg-0.6.1/libavutil/mathematics.c: In function ‘av_rescale_rnd’:

/home/bfredericks/Desktop/blackfin-linux-dist/lib/ffmpeg/build/../ffmpeg-0.6.1/libavutil/mathematics.c:81: warning: comparison of unsigned expression >= 0 is always true

/home/bfredericks/Desktop/blackfin-linux-dist/lib/ffmpeg/build/../ffmpeg-0.6.1/libswscale/bfin/swscale_bfin.c: In function ‘ff_bfin_get_unscaled_swscale’:

/home/bfredericks/Desktop/blackfin-linux-dist/lib/ffmpeg/build/../ffmpeg-0.6.1/libswscale/bfin/swscale_bfin.c:86: warning: assignment from incompatible pointer type

/home/bfredericks/Desktop/blackfin-linux-dist/lib/ffmpeg/build/../ffmpeg-0.6.1/libswscale/bfin/swscale_bfin.c:91: warning: assignment from incompatible pointer type

/home/bfredericks/Desktop/blackfin-linux-dist/lib/ffmpeg/build/../ffmpeg-0.6.1/libswscale/bfin/swscale_bfin.c:81: warning: unused variable ‘swScale’

/home/bfredericks/Desktop/blackfin-linux-dist/lib/ffmpeg/build/../ffmpeg-0.6.1/libswscale/bfin/yuv2rgb_bfin.c: In function ‘ff_yuv2rgb_get_func_ptr_bfin’:

/home/bfredericks/Desktop/blackfin-linux-dist/lib/ffmpeg/build/../ffmpeg-0.6.1/libswscale/bfin/yuv2rgb_bfin.c:189: warning: assignment from incompatible pointer type

/home/bfredericks/Desktop/blackfin-linux-dist/lib/ffmpeg/build/../ffmpeg-0.6.1/libswscale/bfin/yuv2rgb_bfin.c:190: warning: assignment from incompatible pointer type

/home/bfredericks/Desktop/blackfin-linux-dist/lib/ffmpeg/build/../ffmpeg-0.6.1/libswscale/bfin/yuv2rgb_bfin.c:191: warning: assignment from incompatible pointer type

/home/bfredericks/Desktop/blackfin-linux-dist/lib/ffmpeg/build/../ffmpeg-0.6.1/libswscale/bfin/yuv2rgb_bfin.c:192: warning: assignment from incompatible pointer type

/home/bfredericks/Desktop/blackfin-linux-dist/lib/ffmpeg/build/../ffmpeg-0.6.1/libswscale/bfin/yuv2rgb_bfin.c:193: warning: assignment from incompatible pointer type

/home/bfredericks/Desktop/blackfin-linux-dist/lib/ffmpeg/build/../ffmpeg-0.6.1/libswscale/bfin/yuv2rgb_bfin.c:194: warning: assignment from incompatible pointer type

In file included from /home/bfredericks/Desktop/blackfin-linux-dist/lib/ffmpeg/build/../ffmpeg-0.6.1/libswscale/swscale.c:1187:

/home/bfredericks/Desktop/blackfin-linux-dist/lib/ffmpeg/build/../ffmpeg-0.6.1/libswscale/swscale_template.c: In function ‘sws_init_swScale_C’:

/home/bfredericks/Desktop/blackfin-linux-dist/lib/ffmpeg/build/../ffmpeg-0.6.1/libswscale/swscale_template.c:2965: warning: assignment from incompatible pointer type

/home/bfredericks/Desktop/blackfin-linux-dist/lib/ffmpeg/build/../ffmpeg-0.6.1/libswscale/swscale_template.c:2980: warning: assignment from incompatible pointer type

/home/bfredericks/Desktop/blackfin-linux-dist/lib/ffmpeg/build/../ffmpeg-0.6.1/libswscale/swscale_template.c:3025: warning: assignment from incompatible pointer type

/home/bfredericks/Desktop/blackfin-linux-dist/lib/ffmpeg/build/../ffmpeg-0.6.1/libswscale/yuv2rgb.c: In function ‘ff_yuv2rgb_c_init_tables’:

/home/bfredericks/Desktop/blackfin-linux-dist/lib/ffmpeg/build/../ffmpeg-0.6.1/libswscale/yuv2rgb.c:754: warning: passing argument 4 of ‘fill_table’ from incompatible pointer type

/home/bfredericks/Desktop/blackfin-linux-dist/lib/ffmpeg/build/../ffmpeg-0.6.1/libswscale/yuv2rgb.c:755: warning: passing argument 4 of ‘fill_table’ from incompatible pointer type

/home/bfredericks/Desktop/blackfin-linux-dist/lib/ffmpeg/build/../ffmpeg-0.6.1/libswscale/yuv2rgb.c:756: warning: passing argument 4 of ‘fill_table’ from incompatible pointer type

/home/bfredericks/Desktop/blackfin-linux-dist/lib/ffmpeg/build/../ffmpeg-0.6.1/libswscale/yuv2rgb.c:777: warning: passing argument 4 of ‘fill_table’ from incompatible pointer type

/home/bfredericks/Desktop/blackfin-linux-dist/lib/ffmpeg/build/../ffmpeg-0.6.1/libswscale/yuv2rgb.c:778: warning: passing argument 4 of ‘fill_table’ from incompatible pointer type

/home/bfredericks/Desktop/blackfin-linux-dist/lib/ffmpeg/build/../ffmpeg-0.6.1/libswscale/yuv2rgb.c:779: warning: passing argument 4 of ‘fill_table’ from incompatible pointer type

/home/bfredericks/Desktop/blackfin-linux-dist/lib/ffmpeg/build/../ffmpeg-0.6.1/libswscale/yuv2rgb.c:814: warning: passing argument 4 of ‘fill_table’ from incompatible pointer type

/home/bfredericks/Desktop/blackfin-linux-dist/lib/ffmpeg/build/../ffmpeg-0.6.1/libswscale/yuv2rgb.c:815: warning: passing argument 4 of ‘fill_table’ from incompatible pointer type

/home/bfredericks/Desktop/blackfin-linux-dist/lib/ffmpeg/build/../ffmpeg-0.6.1/libswscale/yuv2rgb.c:816: warning: passing argument 4 of ‘fill_table’ from incompatible pointer type

/home/bfredericks/Desktop/blackfin-linux-dist/lib/ffmpeg/build/../ffmpeg-0.6.1/ffmpeg.c: In function ‘do_video_out’:

/home/bfredericks/Desktop/blackfin-linux-dist/lib/ffmpeg/build/../ffmpeg-0.6.1/ffmpeg.c:1085: warning: passing argument 2 of ‘sws_scale’ from incompatible pointer type

/home/bfredericks/Desktop/blackfin-linux-dist/lib/ffmpeg/build/../ffmpeg-0.6.1/ffplay.c: In function ‘queue_picture’:

/home/bfredericks/Desktop/blackfin-linux-dist/lib/ffmpeg/build/../ffmpeg-0.6.1/ffplay.c:1436: warning: passing argument 2 of ‘sws_scale’ from incompatible pointer type

/home/bfredericks/Desktop/blackfin-linux-dist/lib/ffmpeg/build/../ffmpeg-0.6.1/ffplay.c: In function ‘main’:

/home/bfredericks/Desktop/blackfin-linux-dist/lib/ffmpeg/build/../ffmpeg-0.6.1/ffplay.c:3157: warning: assignment discards qualifiers from pointer target type

/home/bfredericks/Desktop/blackfin-linux-dist/lib/ffmpeg/build/../ffmpeg-0.6.1/ffserver.c: In function ‘start_children’:

/home/bfredericks/Desktop/blackfin-linux-dist/lib/ffmpeg/build/../ffmpeg-0.6.1/ffserver.c:444: warning: implicit declaration of function ‘fork’

/home/bfredericks/Desktop/blackfin-linux-dist/lib/ffmpeg/build/../ffmpeg-0.6.1/ffserver.c: In function ‘rtsp_cmd_describe’:

/home/bfredericks/Desktop/blackfin-linux-dist/lib/ffmpeg/build/../ffmpeg-0.6.1/ffserver.c:2987: warning: implicit declaration of function ‘ff_url_split’

/opt/uClinux/bfin-linux-uclibc/lib/gcc/bfin-linux-uclibc/4.3.5/../../../../bfin-linux-uclibc/bin/ld: warning: type and size of dynamic symbol `__ROFIXUP_LIST__@@LIBAVCODEC_52' are not defined

/opt/uClinux/bfin-linux-uclibc/lib/gcc/bfin-linux-uclibc/4.3.5/../../../../bfin-linux-uclibc/bin/ld: warning: type and size of dynamic symbol `__ROFIXUP_END__@@LIBAVCODEC_52' are not defined

/opt/uClinux/bfin-linux-uclibc/bfin-linux-uclibc/runtime/usr/lib/crt1.o: In function `__start':

(.text+0x12): warning: relocation references symbol not defined in the module

/opt/uClinux/bfin-linux-uclibc/lib/gcc/bfin-linux-uclibc/4.3.5/../../../../bfin-linux-uclibc/bin/ld: final link failed: Nonrepresentable section on output

collect2: ld returned 1 exit status

make[4]: *** [ffplay_g] Error 1

make[4]: *** Waiting for unfinished jobs....

/opt/uClinux/bfin-linux-uclibc/lib/gcc/bfin-linux-uclibc/4.3.5/../../../../bfin-linux-uclibc/bin/ld: warning: type and size of dynamic symbol `__ROFIXUP_LIST__@@LIBAVCODEC_52' are not defined

/opt/uClinux/bfin-linux-uclibc/lib/gcc/bfin-linux-uclibc/4.3.5/../../../../bfin-linux-uclibc/bin/ld: warning: type and size of dynamic symbol `__ROFIXUP_END__@@LIBAVCODEC_52' are not defined

/opt/uClinux/bfin-linux-uclibc/bfin-linux-uclibc/runtime/usr/lib/crt1.o: In function `__start':

(.text+0x12): warning: relocation references symbol not defined in the module

/opt/uClinux/bfin-linux-uclibc/lib/gcc/bfin-linux-uclibc/4.3.5/../../../../bfin-linux-uclibc/bin/ld: final link failed: Nonrepresentable section on output

collect2: ld returned 1 exit status

make[4]: *** [ffserver_g] Error 1

/opt/uClinux/bfin-linux-uclibc/lib/gcc/bfin-linux-uclibc/4.3.5/../../../../bfin-linux-uclibc/bin/ld: warning: type and size of dynamic symbol `__ROFIXUP_LIST__@@LIBAVCODEC_52' are not defined

/opt/uClinux/bfin-linux-uclibc/lib/gcc/bfin-linux-uclibc/4.3.5/../../../../bfin-linux-uclibc/bin/ld: warning: type and size of dynamic symbol `__ROFIXUP_END__@@LIBAVCODEC_52' are not defined

/opt/uClinux/bfin-linux-uclibc/bfin-linux-uclibc/runtime/usr/lib/crt1.o: In function `__start':

(.text+0x12): warning: relocation references symbol not defined in the module

/opt/uClinux/bfin-linux-uclibc/lib/gcc/bfin-linux-uclibc/4.3.5/../../../../bfin-linux-uclibc/bin/ld: final link failed: Nonrepresentable section on output

collect2: ld returned 1 exit status

make[4]: *** [ffmpeg_g] Error 1

/opt/uClinux/bfin-linux-uclibc/lib/gcc/bfin-linux-uclibc/4.3.5/../../../../bfin-linux-uclibc/bin/ld: warning: type and size of dynamic symbol `__ROFIXUP_LIST__@@LIBAVCODEC_52' are not defined

/opt/uClinux/bfin-linux-uclibc/lib/gcc/bfin-linux-uclibc/4.3.5/../../../../bfin-linux-uclibc/bin/ld: warning: type and size of dynamic symbol `__ROFIXUP_END__@@LIBAVCODEC_52' are not defined

/opt/uClinux/bfin-linux-uclibc/bfin-linux-uclibc/runtime/usr/lib/crt1.o: In function `__start':

(.text+0x12): warning: relocation references symbol not defined in the module

/opt/uClinux/bfin-linux-uclibc/lib/gcc/bfin-linux-uclibc/4.3.5/../../../../bfin-linux-uclibc/bin/ld: final link failed: Nonrepresentable section on output

collect2: ld returned 1 exit status

make[4]: *** [ffprobe_g] Error 1

make[3]: *** [all] Error 2

make[2]: *** [ffmpeg] Error 2

make[1]: *** [all] Error 2

make: *** [subdirs] Error 1

[bfredericks@blair blackfin-linux-dist]$

QuoteReplyEditDelete

 

 

2011-01-19 03:04:16     Re: FFMPEG 0.6.1

Mike Frysinger (UNITED STATES)

Message: 97540   

 

help with what ?  you're still building ffmpeg 0.6.1 and not what's shipping in the release

Attachments

    Outcomes