2010-10-11 05:14:37     Core b problem for bf561

Document created by Aaronwu Employee on Aug 23, 2013
Version 1Show Document
  • View in full screen mode

2010-10-11 05:14:37     Core b problem for bf561

asma chiha (TUNISIA)

Message: 94400   

 

Hi, i have a problem when i make uClinux 2008 R1 with the corebld floder,

 

and this is the error:

 

WARNING: "create_proc_entry" [/home/asma/uClinux-dist-2008R1-RC8/user/blkfin-apps/corebld/test_module/dualcore_test.ko] undefined!

WARNING: "printk" [/home/asma/uClinux-dist-2008R1-RC8/user/blkfin-apps/corebld/test_module/dualcore_test.ko] undefined!

  CC      /home/asma/uClinux-dist-2008R1-RC8/user/blkfin-apps/corebld/test_module/dualcore_test.mod.o

/home/asma/uClinux-dist-2008R1-RC8/user/blkfin-apps/corebld/test_module/dualcore_test.mod.c:8: error: variable ‘__this_module’ has initializer but incomplete type

/home/asma/uClinux-dist-2008R1-RC8/user/blkfin-apps/corebld/test_module/dualcore_test.mod.c:9: error: unknown field ‘name’ specified in initializer

/home/asma/uClinux-dist-2008R1-RC8/user/blkfin-apps/corebld/test_module/dualcore_test.mod.c:9: warning: excess elements in struct initializer

/home/asma/uClinux-dist-2008R1-RC8/user/blkfin-apps/corebld/test_module/dualcore_test.mod.c:9: warning: (near initialization for ‘__this_module’)

/home/asma/uClinux-dist-2008R1-RC8/user/blkfin-apps/corebld/test_module/dualcore_test.mod.c:10: error: unknown field ‘init’ specified in initializer

/home/asma/uClinux-dist-2008R1-RC8/user/blkfin-apps/corebld/test_module/dualcore_test.mod.c:10: warning: excess elements in struct initializer

/home/asma/uClinux-dist-2008R1-RC8/user/blkfin-apps/corebld/test_module/dualcore_test.mod.c:10: warning: (near initialization for ‘__this_module’)

/home/asma/uClinux-dist-2008R1-RC8/user/blkfin-apps/corebld/test_module/dualcore_test.mod.c:14: error: unknown field ‘arch’ specified in initializer

/home/asma/uClinux-dist-2008R1-RC8/user/blkfin-apps/corebld/test_module/dualcore_test.mod.c:14: error: ‘MODULE_ARCH_INIT’ undeclared here (not in a function)

/home/asma/uClinux-dist-2008R1-RC8/user/blkfin-apps/corebld/test_module/dualcore_test.mod.c:14: warning: excess elements in struct initializer

/home/asma/uClinux-dist-2008R1-RC8/user/blkfin-apps/corebld/test_module/dualcore_test.mod.c:14: warning: (near initialization for ‘__this_module’)

make[6]: *** [/home/asma/uClinux-dist-2008R1-RC8/user/blkfin-apps/corebld/test_module/dualcore_test.mod.o] Error

 

 

 

Please if anyone know anything about this problem???

TranslateQuoteReplyEditDelete

 

 

2010-10-11 05:18:36     Re: Core b problem for bf561

Mike Frysinger (UNITED STATES)

Message: 94401   

 

you're using a very old release.  this issue has been fixed long ago.  upgrade to the latest release.

Attachments

    Outcomes