2010-10-08 09:49:58     build failure at busybox?

Document created by Aaronwu Employee on Aug 23, 2013
Version 1Show Document
  • View in full screen mode

2010-10-08 09:49:58     build failure at busybox?

T. Jump (UNITED STATES)

Message: 94339   

 

Runing Make does not complete. The only warning I see is:

 

/home/srv1bf537/srv1-linux/uClinux/user/busybox/busybox-1.13.4/applets/usage.c: In function ‘main’:

/home/srv1bf537/srv1-linux/uClinux/user/busybox/busybox-1.13.4/applets/usage.c:27: warning: ignoring return value of ‘write’, declared with attribute warn_unused_result

 

 

 

Terminating lines of Make attempt are:

 

  LINK    busybox_unstripped

Trying libraries: crypt m

Library crypt is not needed, excluding it

Library m is not needed, excluding it

Final link with: <none>

make[5]: Leaving directory `/home/srv1bf537/srv1-linux/uClinux/user/busybox/build-busybox-1.13.4'

make[4]: Leaving directory `/home/srv1bf537/srv1-linux/uClinux/user/busybox'

make[3]: Leaving directory `/home/srv1bf537/srv1-linux/uClinux/user'

make[2]: *** [all] Error 2

make[2]: Leaving directory `/home/srv1bf537/srv1-linux/uClinux/user'

make[1]: *** [subdirs] Error 1

make[1]: Leaving directory `/home/srv1bf537/srv1-linux/uClinux'

make: *** [build] Error 2

srv1bf537@ubuntu:~/srv1-linux$

 

 

 

Using:

 

uClinux-dist-2009R1.1-RC4

 

make output

QuoteReplyEditDelete

 

 

2010-10-08 13:25:12     Re: build failure at busybox?

Mike Frysinger (UNITED STATES)

Message: 94340   

 

your log is incomplete and doesnt contain the actual error.  you need to read the whole log, or run `make single` so that it aborts at the first error.

 

there is no problem with busybox at all.

QuoteReplyEditDelete

 

 

2010-10-08 15:07:34     Re: build failure at busybox?

T. Jump (UNITED STATES)

Message: 94342   

 

Okay. I see this now. I thought I copied the full output but apparently not. I will run this again and get back.

QuoteReplyEditDelete

 

 

2010-10-09 11:53:01     Re: build failure at busybox?

T. Jump (UNITED STATES)

Message: 94363   

 

This is solved. I needed to learn how to output the script using ">". Once I could review the full script I found the errors and was able to correct most. There is a new issue/different question but this is for a different thread.

 

Thanks for the help.

QuoteReplyEditDelete

Attachments

Outcomes