2009-06-05 12:42:34     QT 4.5.1 Webkit Compile Error

Document created by Aaronwu Employee on Aug 15, 2013
Version 1Show Document
  • View in full screen mode

2009-06-05 12:42:34     QT 4.5.1 Webkit Compile Error

Ross Squires (UNITED STATES)

Message: 75256   

 

I've currently got an issue compiling Webkit with QT 4.5.1. I'm seeing this:

 

/home/rossimo/blackfin-sources/uclinux-dist/lib/qt-embedded/qt-embedded-linux-opensource-src-4.5.1/src/3rdparty/webkit/WebCore/platform/FileSystem.h:101: error: expected initializer before ‘*’ token

/home/rossimo/blackfin-sources/uclinux-dist/lib/qt-embedded/qt-embedded-linux-opensource-src-4.5.1/src/3rdparty/webkit/WebCore/platform/FileSystem.h:159: error: ‘PlatformModule’ was not declared in this scope

make[5]: *** [.obj/release-static-emb-bfin/File.o] Error 1

make[5]: *** Waiting for unfinished jobs....

make[5]: Leaving directory `/home/rossimo/blackfin-sources/uclinux-dist/lib/qt-embedded/build-qt-embedded-linux-opensource-src-4.5.1/src/3rdparty/webkit/WebCore'

make[4]: *** [sub-webkit-install_subtargets-ordered] Error 2

make[4]: Leaving directory `/home/rossimo/blackfin-sources/uclinux-dist/lib/qt-embedded/build-qt-embedded-linux-opensource-src-4.5.1'

make[3]: *** [all] Error 2

make[3]: Leaving directory `/home/rossimo/blackfin-sources/uclinux-dist/lib/qt-embedded'

make[2]: *** [qt-embedded] Error 2

make[2]: Leaving directory `/home/rossimo/blackfin-sources/uclinux-dist/lib'

make[1]: *** [all] Error 2

make[1]: Leaving directory `/home/rossimo/blackfin-sources/uclinux-dist/lib'

make: *** [subdirs] Error 1

 

 

 

Is anyone else having this issue? Any ideas?

QuoteReplyEditDelete

 

 

2009-06-08 11:01:39     Re: QT 4.5.1 Webkit Compile Error

Ross Squires (UNITED STATES)

Message: 75349   

 

I've done some tweaking since then, changed the binary format to FDPIC, did some recompiling, and that seems to have fixed the problem.

Attachments

    Outcomes