2008-02-18 17:42:07     Problems Compiling the Surveyor SRV1 Kernel

Document created by Aaronwu Employee on Aug 5, 2013
Version 1Show Document
  • View in full screen mode

2008-02-18 17:42:07     Problems Compiling the Surveyor SRV1 Kernel

Shane Kirkbride (UNITED STATES)

Message: 51235    Hi,

I'm trying to compile the Surveyor SRV1 Kernel. I'm getting these errors (the compile log):

...

Compiling /store/home/skirkbri/bfin-sources/uclinux-dist/staging/usr/lib/python2.4/test/test_shutil.py ...

Compiling /store/home/skirkbri/bfin-sources/uclinux-dist/staging/usr/lib/python2.4/test/test_signal.py ...

Compiling /store/home/skirkbri/bfin-sources/uclinux-dist/staging/usr/lib/python2.4/test/test_site.py ...

Compiling /store/home/skirkbri/bfin-sources/uclinux-dist/staging/usr/lib/python2.4/test/test_slice.py ...

Compiling /store/home/skirkbri/bfin-sources/uclinux-dist/staging/usr/lib/python2.4/test/test_socket.py ...

Compiling /store/home/skirkbri/bfin-sources/uclinux-dist/staging/usr/lib/python2.4/test/test_socket_ssl.py ...

Compiling /store/home/skirkbri/bfin-sources/uclinux-dist/staging/usr/lib/python2.4/test/test_socketserver.py ...

Compiling /store/home/skirkbri/bfin-sources/uclinux-dist/staging/usr/lib/python2.4/test/test_softspace.py ...

Compiling /store/home/skirkbri/bfin-sources/uclinux-dist/staging/usr/lib/python2.4/test/test_sort.py ...

Compiling /store/home/skirkbri/bfin-sources/uclinux-dist/staging/usr/lib/python2.4/test/test_str.py ...

Compiling /store/home/skirkbri/bfin-sources/uclinux-dist/staging/usr/lib/python2.4/test/test_strftime.py ...

Compiling /store/home/skirkbri/bfin-sources/uclinux-dist/staging/usr/lib/python2.4/test/test_string.py ...

Compiling /store/home/skirkbri/bfin-sources/uclinux-dist/staging/usr/lib/python2.4/test/test_stringprep.py ...

Compiling /store/home/skirkbri/bfin-sources/uclinux-dist/staging/usr/lib/python2.4/test/test_strop.py ...

Compiling /store/home/skirkbri/bfin-sources/uclinux-dist/staging/usr/lib/python2.4/test/test_strptime.py ...

Compiling /store/home/skirkbri/bfin-sources/uclinux-dist/staging/usr/lib/python2.4/test/test_struct.py ...

Compiling /store/home/skirkbri/bfin-sources/uclinux-dist/staging/usr/lib/python2.4/test/test_structseq.py ...

Compiling /store/home/skirkbri/bfin-sources/uclinux-dist/staging/usr/lib/python2.4/test/test_subprocess.py ...

Compiling /store/home/skirkbri/bfin-sources/uclinux-dist/staging/usr/lib/python2.4/test/test_sunaudiodev.py ...

Compiling /store/home/skirkbri/bfin-sources/uclinux-dist/staging/usr/lib/python2.4/test/test_sundry.py ...

Compiling /store/home/skirkbri/bfin-sources/uclinux-dist/staging/usr/lib/python2.4/test/test_support.py ...

Compiling /store/home/skirkbri/bfin-sources/uclinux-dist/staging/usr/lib/python2.4/test/test_symtable.py ...

Compiling /store/home/skirkbri/bfin-sources/uclinux-dist/staging/usr/lib/python2.4/test/test_syntax.py ...

Compiling /store/home/skirkbri/bfin-sources/uclinux-dist/staging/usr/lib/python2.4/test/test_sys.py ...

Compiling /store/home/skirkbri/bfin-sources/uclinux-dist/staging/usr/lib/python2.4/test/test_tarfile.py ...

Compiling /store/home/skirkbri/bfin-sources/uclinux-dist/staging/usr/lib/python2.4/test/test_tcl.py ...

Compiling /store/home/skirkbri/bfin-sources/uclinux-dist/staging/usr/lib/python2.4/test/test_tempfile.py ...

Compiling /store/home/skirkbri/bfin-sources/uclinux-dist/staging/usr/lib/python2.4/test/test_textwrap.py ...

Compiling /store/home/skirkbri/bfin-sources/uclinux-dist/staging/usr/lib/python2.4/test/test_thread.py ...

Compiling /store/home/skirkbri/bfin-sources/uclinux-dist/staging/usr/lib/python2.4/test/test_threaded_import.py ...

Compiling /store/home/skirkbri/bfin-sources/uclinux-dist/staging/usr/lib/python2.4/test/test_threadedtempfile.py ...

Compiling /store/home/skirkbri/bfin-sources/uclinux-dist/staging/usr/lib/python2.4/test/test_threading.py ...

Compiling /store/home/skirkbri/bfin-sources/uclinux-dist/staging/usr/lib/python2.4/test/test_threading_local.py ...

Compiling /store/home/skirkbri/bfin-sources/uclinux-dist/staging/usr/lib/python2.4/test/test_threadsignals.py ...

Compiling /store/home/skirkbri/bfin-sources/uclinux-dist/staging/usr/lib/python2.4/test/test_time.py ...

Compiling /store/home/skirkbri/bfin-sources/uclinux-dist/staging/usr/lib/python2.4/test/test_timeout.py ...

Compiling /store/home/skirkbri/bfin-sources/uclinux-dist/staging/usr/lib/python2.4/test/test_timing.py ...

Compiling /store/home/skirkbri/bfin-sources/uclinux-dist/staging/usr/lib/python2.4/test/test_tokenize.py ...

Compiling /store/home/skirkbri/bfin-sources/uclinux-dist/staging/usr/lib/python2.4/test/test_trace.py ...

Compiling /store/home/skirkbri/bfin-sources/uclinux-dist/staging/usr/lib/python2.4/test/test_traceback.py ...

Compiling /store/home/skirkbri/bfin-sources/uclinux-dist/staging/usr/lib/python2.4/test/test_transformer.py ...

Compiling /store/home/skirkbri/bfin-sources/uclinux-dist/staging/usr/lib/python2.4/test/test_tuple.py ...

Compiling /store/home/skirkbri/bfin-sources/uclinux-dist/staging/usr/lib/python2.4/test/test_types.py ...

Compiling /store/home/skirkbri/bfin-sources/uclinux-dist/staging/usr/lib/python2.4/test/test_ucn.py ...

Compiling /store/home/skirkbri/bfin-sources/uclinux-dist/staging/usr/lib/python2.4/test/test_unary.py ...

Compiling /store/home/skirkbri/bfin-sources/uclinux-dist/staging/usr/lib/python2.4/test/test_unicode.py ...

Compiling /store/home/skirkbri/bfin-sources/uclinux-dist/staging/usr/lib/python2.4/test/test_unicode_file.py ...

Compiling /store/home/skirkbri/bfin-sources/uclinux-dist/staging/usr/lib/python2.4/test/test_unicodedata.py ...

Compiling /store/home/skirkbri/bfin-sources/uclinux-dist/staging/usr/lib/python2.4/test/test_unittest.py ...

Compiling /store/home/skirkbri/bfin-sources/uclinux-dist/staging/usr/lib/python2.4/test/test_univnewlines.py ...

Compiling /store/home/skirkbri/bfin-sources/uclinux-dist/staging/usr/lib/python2.4/test/test_unpack.py ...

Compiling /store/home/skirkbri/bfin-sources/uclinux-dist/staging/usr/lib/python2.4/test/test_urllib.py ...

Compiling /store/home/skirkbri/bfin-sources/uclinux-dist/staging/usr/lib/python2.4/test/test_urllib2.py ...

Compiling /store/home/skirkbri/bfin-sources/uclinux-dist/staging/usr/lib/python2.4/test/test_urllib2net.py ...

Compiling /store/home/skirkbri/bfin-sources/uclinux-dist/staging/usr/lib/python2.4/test/test_urllibnet.py ...

Compiling /store/home/skirkbri/bfin-sources/uclinux-dist/staging/usr/lib/python2.4/test/test_urlparse.py ...

Compiling /store/home/skirkbri/bfin-sources/uclinux-dist/staging/usr/lib/python2.4/test/test_userdict.py ...

Compiling /store/home/skirkbri/bfin-sources/uclinux-dist/staging/usr/lib/python2.4/test/test_userlist.py ...

Compiling /store/home/skirkbri/bfin-sources/uclinux-dist/staging/usr/lib/python2.4/test/test_userstring.py ...

Compiling /store/home/skirkbri/bfin-sources/uclinux-dist/staging/usr/lib/python2.4/test/test_uu.py ...

Compiling /store/home/skirkbri/bfin-sources/uclinux-dist/staging/usr/lib/python2.4/test/test_warnings.py ...

Compiling /store/home/skirkbri/bfin-sources/uclinux-dist/staging/usr/lib/python2.4/test/test_wave.py ...

Compiling /store/home/skirkbri/bfin-sources/uclinux-dist/staging/usr/lib/python2.4/test/test_weakref.py ...

Compiling /store/home/skirkbri/bfin-sources/uclinux-dist/staging/usr/lib/python2.4/test/test_whichdb.py ...

Compiling /store/home/skirkbri/bfin-sources/uclinux-dist/staging/usr/lib/python2.4/test/test_winreg.py ...

Compiling /store/home/skirkbri/bfin-sources/uclinux-dist/staging/usr/lib/python2.4/test/test_winsound.py ...

Compiling /store/home/skirkbri/bfin-sources/uclinux-dist/staging/usr/lib/python2.4/test/test_xmllib.py ...

Compiling /store/home/skirkbri/bfin-sources/uclinux-dist/staging/usr/lib/python2.4/test/test_xmlrpc.py ...

Compiling /store/home/skirkbri/bfin-sources/uclinux-dist/staging/usr/lib/python2.4/test/test_xpickle.py ...

Compiling /store/home/skirkbri/bfin-sources/uclinux-dist/staging/usr/lib/python2.4/test/test_xrange.py ...

Compiling /store/home/skirkbri/bfin-sources/uclinux-dist/staging/usr/lib/python2.4/test/test_zipfile.py ...

Compiling /store/home/skirkbri/bfin-sources/uclinux-dist/staging/usr/lib/python2.4/test/test_zipimport.py ...

Compiling /store/home/skirkbri/bfin-sources/uclinux-dist/staging/usr/lib/python2.4/test/test_zlib.py ...

Compiling /store/home/skirkbri/bfin-sources/uclinux-dist/staging/usr/lib/python2.4/test/testall.py ...

Compiling /store/home/skirkbri/bfin-sources/uclinux-dist/staging/usr/lib/python2.4/test/testcodec.py ...

Compiling /store/home/skirkbri/bfin-sources/uclinux-dist/staging/usr/lib/python2.4/test/tf_inherit_check.py ...

Compiling /store/home/skirkbri/bfin-sources/uclinux-dist/staging/usr/lib/python2.4/test/threaded_import_hangers.py ...

Compiling /store/home/skirkbri/bfin-sources/uclinux-dist/staging/usr/lib/python2.4/test/xmltests.py ...

Compiling /store/home/skirkbri/bfin-sources/uclinux-dist/staging/usr/lib/python2.4/textwrap.py ...

Compiling /store/home/skirkbri/bfin-sources/uclinux-dist/staging/usr/lib/python2.4/this.py ...

Compiling /store/home/skirkbri/bfin-sources/uclinux-dist/staging/usr/lib/python2.4/threading.py ...

Compiling /store/home/skirkbri/bfin-sources/uclinux-dist/staging/usr/lib/python2.4/timeit.py ...

Compiling /store/home/skirkbri/bfin-sources/uclinux-dist/staging/usr/lib/python2.4/toaiff.py ...

Compiling /store/home/skirkbri/bfin-sources/uclinux-dist/staging/usr/lib/python2.4/token.py ...

Compiling /store/home/skirkbri/bfin-sources/uclinux-dist/staging/usr/lib/python2.4/tokenize.py ...

Compiling /store/home/skirkbri/bfin-sources/uclinux-dist/staging/usr/lib/python2.4/trace.py ...

Compiling /store/home/skirkbri/bfin-sources/uclinux-dist/staging/usr/lib/python2.4/traceback.py ...

Compiling /store/home/skirkbri/bfin-sources/uclinux-dist/staging/usr/lib/python2.4/tty.py ...

Compiling /store/home/skirkbri/bfin-sources/uclinux-dist/staging/usr/lib/python2.4/types.py ...

Compiling /store/home/skirkbri/bfin-sources/uclinux-dist/staging/usr/lib/python2.4/tzparse.py ...

Compiling /store/home/skirkbri/bfin-sources/uclinux-dist/staging/usr/lib/python2.4/unittest.py ...

Compiling /store/home/skirkbri/bfin-sources/uclinux-dist/staging/usr/lib/python2.4/urllib.py ...

Compiling /store/home/skirkbri/bfin-sources/uclinux-dist/staging/usr/lib/python2.4/urllib2.py ...

Compiling /store/home/skirkbri/bfin-sources/uclinux-dist/staging/usr/lib/python2.4/urlparse.py ...

Compiling /store/home/skirkbri/bfin-sources/uclinux-dist/staging/usr/lib/python2.4/user.py ...

Compiling /store/home/skirkbri/bfin-sources/uclinux-dist/staging/usr/lib/python2.4/uu.py ...

Compiling /store/home/skirkbri/bfin-sources/uclinux-dist/staging/usr/lib/python2.4/warnings.py ...

Compiling /store/home/skirkbri/bfin-sources/uclinux-dist/staging/usr/lib/python2.4/wave.py ...

Compiling /store/home/skirkbri/bfin-sources/uclinux-dist/staging/usr/lib/python2.4/weakref.py ...

Compiling /store/home/skirkbri/bfin-sources/uclinux-dist/staging/usr/lib/python2.4/webbrowser.py ...

Compiling /store/home/skirkbri/bfin-sources/uclinux-dist/staging/usr/lib/python2.4/whichdb.py ...

Compiling /store/home/skirkbri/bfin-sources/uclinux-dist/staging/usr/lib/python2.4/whrandom.py ...

Compiling /store/home/skirkbri/bfin-sources/uclinux-dist/staging/usr/lib/python2.4/xdrlib.py ...

Listing /store/home/skirkbri/bfin-sources/uclinux-dist/staging/usr/lib/python2.4/xml ...

Compiling /store/home/skirkbri/bfin-sources/uclinux-dist/staging/usr/lib/python2.4/xml/__init__.py ...

Listing /store/home/skirkbri/bfin-sources/uclinux-dist/staging/usr/lib/python2.4/xml/dom ...

Compiling /store/home/skirkbri/bfin-sources/uclinux-dist/staging/usr/lib/python2.4/xml/dom/NodeFilter.py ...

Compiling /store/home/skirkbri/bfin-sources/uclinux-dist/staging/usr/lib/python2.4/xml/dom/__init__.py ...

Compiling /store/home/skirkbri/bfin-sources/uclinux-dist/staging/usr/lib/python2.4/xml/dom/domreg.py ...

Compiling /store/home/skirkbri/bfin-sources/uclinux-dist/staging/usr/lib/python2.4/xml/dom/expatbuilder.py ...

Compiling /store/home/skirkbri/bfin-sources/uclinux-dist/staging/usr/lib/python2.4/xml/dom/minicompat.py ...

Compiling /store/home/skirkbri/bfin-sources/uclinux-dist/staging/usr/lib/python2.4/xml/dom/minidom.py ...

Compiling /store/home/skirkbri/bfin-sources/uclinux-dist/staging/usr/lib/python2.4/xml/dom/pulldom.py ...

Compiling /store/home/skirkbri/bfin-sources/uclinux-dist/staging/usr/lib/python2.4/xml/dom/xmlbuilder.py ...

Listing /store/home/skirkbri/bfin-sources/uclinux-dist/staging/usr/lib/python2.4/xml/parsers ...

Compiling /store/home/skirkbri/bfin-sources/uclinux-dist/staging/usr/lib/python2.4/xml/parsers/__init__.py ...

Compiling /store/home/skirkbri/bfin-sources/uclinux-dist/staging/usr/lib/python2.4/xml/parsers/expat.py ...

Listing /store/home/skirkbri/bfin-sources/uclinux-dist/staging/usr/lib/python2.4/xml/sax ...

Compiling /store/home/skirkbri/bfin-sources/uclinux-dist/staging/usr/lib/python2.4/xml/sax/__init__.py ...

Compiling /store/home/skirkbri/bfin-sources/uclinux-dist/staging/usr/lib/python2.4/xml/sax/_exceptions.py ...

Compiling /store/home/skirkbri/bfin-sources/uclinux-dist/staging/usr/lib/python2.4/xml/sax/expatreader.py ...

Compiling /store/home/skirkbri/bfin-sources/uclinux-dist/staging/usr/lib/python2.4/xml/sax/handler.py ...

Compiling /store/home/skirkbri/bfin-sources/uclinux-dist/staging/usr/lib/python2.4/xml/sax/saxutils.py ...

Compiling /store/home/skirkbri/bfin-sources/uclinux-dist/staging/usr/lib/python2.4/xml/sax/xmlreader.py ...

Compiling /store/home/skirkbri/bfin-sources/uclinux-dist/staging/usr/lib/python2.4/xmllib.py ...

Compiling /store/home/skirkbri/bfin-sources/uclinux-dist/staging/usr/lib/python2.4/xmlrpclib.py ...

Compiling /store/home/skirkbri/bfin-sources/uclinux-dist/staging/usr/lib/python2.4/zipfile.py ...

PYTHONPATH=/store/home/skirkbri/bfin-sources/uclinux-dist/staging/usr/lib/python2.4   \

                python -Wi -t /store/home/skirkbri/bfin-sources/uclinux-dist/staging/usr/lib/python2.4/compileall.py \

                -d /usr/lib/python2.4/site-packages -f \

                -x badsyntax /store/home/skirkbri/bfin-sources/uclinux-dist/staging/usr/lib/python2.4/site-packages

Listing /store/home/skirkbri/bfin-sources/uclinux-dist/staging/usr/lib/python2.4/site-packages ...

PYTHONPATH=/store/home/skirkbri/bfin-sources/uclinux-dist/staging/usr/lib/python2.4  \

                python -Wi -t -O /store/home/skirkbri/bfin-sources/uclinux-dist/staging/usr/lib/python2.4/compileall.py \

                -d /usr/lib/python2.4/site-packages -f \

                -x badsyntax /store/home/skirkbri/bfin-sources/uclinux-dist/staging/usr/lib/python2.4/site-packages

Listing /store/home/skirkbri/bfin-sources/uclinux-dist/staging/usr/lib/python2.4/site-packages ...

make[4]: Leaving directory `/store/home/skirkbri/bfin-sources/uclinux-dist/user/python/build'

make[3]: Leaving directory `/store/home/skirkbri/bfin-sources/uclinux-dist/user/python'

make[2]: Leaving directory `/store/home/skirkbri/bfin-sources/uclinux-dist/user'

make[1]: *** [all] Error 2

make[1]: Leaving directory `/store/home/skirkbri/bfin-sources/uclinux-dist/user'

make: *** [subdirs] Error 1

skirkbri@buddha:~/bfin-sources/uclinux-dist$

 

I'm not sure what the correct configuration for this kernel should be.  Does anyone have any ideas or places to look? Thanks.

~Shane

QuoteReplyEditDelete

 

 

2008-02-18 18:18:41     Re: Problems Compiling the Surveyor SRV1 Kernel

Mike Frysinger (UNITED STATES)

Message: 51237    that doesnt contain the actual error

 

run `make NON_SMP_BUILD=1` instead

QuoteReplyEditDelete

 

 

2008-02-18 20:47:51     Re: Problems Compiling the Surveyor SRV1 Kernel

Shane Kirkbride (UNITED STATES)

Message: 51245   

 

Thanks. This is what it outputs now...much more useful, but still somewhat unclear on what I need to do:

 

Failed: busybox_unstripped bfin-uclinux-gcc  -Wl,-elf2flt    -mcpu=bf537-0.2   applets/built-in.o  archival/lib.a  archival/libunarchive/lib.a  console-tools/lib.a  coreutils/lib.a  coreutils/libcoreutils/lib.a  debianutils/lib.a  e2fsprogs/lib.a  editors/lib.a  findutils/lib.a  init/lib.a  ipsvd/lib.a  libbb/lib.a  libpwdgrp/lib.a  loginutils/lib.a  miscutils/lib.a  modutils/lib.a  networking/lib.a  networking/libiproute/lib.a  networking/udhcp/lib.a  procps/lib.a  runit/lib.a  selinux/lib.a  shell/lib.a  sysklogd/lib.a  util-linux/lib.a  archival/built-in.o  archival/libunarchive/built-in.o  console-tools/built-in.o  coreutils/built-in.o  coreutils/libcoreutils/built-in.o  debianutils/built-in.o  e2fsprogs/built-in.o  editors/built-in.o  findutils/built-in.o  init/built-in.o  ipsvd/built-in.o  libbb/built-in.o  libpwdgrp/built-in.o  loginutils/built-in.o  miscutils/built-in.o  modutils/built-in.o  networking/built-in.o  networking/libiproute/built-in.o  networking/udhcp/built-in.o  procps/built-in.o  runit/built-in.o  selinux/built-in.o  shell/built-in.o  sysklogd/built-in.o  util-linux/built-in.o  m crypt -Wl,--start-group -lcrypt -lm -Wl,--end-group

Output of:

bfin-uclinux-gcc -Wl,-elf2flt -mcpu=bf537-0.2 -o busybox_unstripped -Wl,--sort-common -Wl,--sort-section -Wl,alignment -Wl,--gc-sections -Wl,--start-group applets/built-in.o archival/lib.a archival/libunarchive/lib.a console-tools/lib.a coreutils/lib.a coreutils/libcoreutils/lib.a debianutils/lib.a e2fsprogs/lib.a editors/lib.a findutils/lib.a init/lib.a ipsvd/lib.a libbb/lib.a libpwdgrp/lib.a loginutils/lib.a miscutils/lib.a modutils/lib.a networking/lib.a networking/libiproute/lib.a networking/udhcp/lib.a procps/lib.a runit/lib.a selinux/lib.a shell/lib.a sysklogd/lib.a util-linux/lib.a archival/built-in.o archival/libunarchive/built-in.o console-tools/built-in.o coreutils/built-in.o coreutils/libcoreutils/built-in.o debianutils/built-in.o e2fsprogs/built-in.o editors/built-in.o findutils/built-in.o init/built-in.o ipsvd/built-in.o libbb/built-in.o libpwdgrp/built-in.o loginutils/built-in.o miscutils/built-in.o modutils/built-in.o networking/built-in.o networking/libiproute/built-in.o networking/udhcp/built-in.o procps/built-in.o runit/built-in.o selinux/built-in.o shell/built-in.o sysklogd/built-in.o util-linux/built-in.o -Wl,--end-group -Wl,--start-group -lcrypt -lm -Wl,--end-group

==========

/store/home/skirkbri/bfin-sources/build/bfin-uclinux/bin/../lib/gcc/bfin-uclinux/4.1.2/../../../../bfin-uclinux/bin/ld.real: Warning: gc-sections option ignored

miscutils/lib.a(crond.o): In function `RunJob':

miscutils/crond.c:919: undefined reference to `_BUG_fork_is_unavailable_on_nommu'

miscutils/lib.a(crontab.o): In function `GetReplaceStream':

miscutils/crontab.c:249: undefined reference to `_BUG_fork_is_unavailable_on_nommu'

miscutils/lib.a(crontab.o): In function `EditFile':

miscutils/crontab.c:288: undefined reference to `_BUG_fork_is_unavailable_on_nommu'

collect2: ld returned 1 exit status

make[4]: *** [busybox_unstripped] Error 1

make[4]: Leaving directory `/store/home/skirkbri/bfin-sources/uclinux-dist/user/busybox/busybox-1.9.0'

make[3]: *** [all] Error 2

make[3]: Leaving directory `/store/home/skirkbri/bfin-sources/uclinux-dist/user/busybox'

make[2]: *** [busybox] Error 2

make[2]: Leaving directory `/store/home/skirkbri/bfin-sources/uclinux-dist/user'

make[1]: *** [all] Error 2

make[1]: Leaving directory `/store/home/skirkbri/bfin-sources/uclinux-dist/user'

make: *** [subdirs] Error 1

skirkbri@buddha:~/bfin-sources/uclinux-dist$

QuoteReplyEditDelete

 

 

2008-02-18 20:54:45     Re: Problems Compiling the Surveyor SRV1 Kernel

Mike Frysinger (UNITED STATES)

Message: 51247    you enabled the busybox cron applets ... dont do that as they dont work on no-mmu currently

QuoteReplyEditDelete

 

 

2008-02-18 21:49:23     Re: Problems Compiling the Surveyor SRV1 Kernel

Shane Kirkbride (UNITED STATES)

Message: 51251    It works now. Thanks!

Attachments

    Outcomes