2008-02-15 17:48:10     Build Error for kernel/bf548

Document created by Aaronwu Employee on Aug 5, 2013
Version 1Show Document
  • View in full screen mode

2008-02-15 17:48:10     Build Error for kernel/bf548

Chris Pane (UNITED STATES)

Message: 51127    Hey Folks,

 

So I have been building out of svn (BF548 Dev Kit) for weeks now, did an update on the kernel source today (To get the fix to include ffplay).

 

I now get the following build errors

 

  CC      drivers/net/loopback.o

  CC [M]  lib/zlib_deflate/deftree.o

  CC [M]  fs/jffs2/writev.o

  CC      net/ipv4/tcp.o

  CC      drivers/net/smsc911x.o

  CC [M]  fs/jffs2/super.o

drivers/net/smsc911x.c: In function ‘smsc911x_poll’:

drivers/net/smsc911x.c:1016: error: ‘struct net_device’ has no member named ‘quota’

drivers/net/smsc911x.c:1016: warning: type defaults to ‘int’ in declaration of ‘_x’

drivers/net/smsc911x.c:1016: error: ‘struct net_device’ has no member named ‘quota’

drivers/net/smsc911x.c:1069: error: ‘struct net_device’ has no member named ‘quota’

drivers/net/smsc911x.c:1075: error: too few arguments to function ‘netif_rx_complete’

drivers/net/smsc911x.c: In function ‘smsc911x_irqhandler’:

drivers/net/smsc911x.c:1542: error: too few arguments to function ‘netif_rx_schedule’

drivers/net/smsc911x.c: In function ‘smsc911x_init’:

drivers/net/smsc911x.c:2025: error: ‘struct net_device’ has no member named ‘poll’

drivers/net/smsc911x.c:2026: error: ‘struct net_device’ has no member named ‘weight’

drivers/net/smsc911x.c: In function ‘smsc911x_drv_probe’:

drivers/net/smsc911x.c:2113: error: implicit declaration of function ‘SET_MODULE_OWNER’

make[3]: *** [drivers/net/smsc911x.o] Error 1

make[2]: *** [drivers/net] Error 2

make[1]: *** [drivers] Error 2

make[1]: *** Waiting for unfinished jobs....

  CC [M]  lib/zlib_deflate/deflate_syms.o

  CC      net/netlink/af_netlink.o

  CC [M]  fs/jffs2/debug.o

  LD [M]  lib/zlib_deflate/zlib_deflate.o

 

QuoteReplyEditDelete

 

 

2008-02-15 17:55:36     Re: Build Error for kernel/bf548

Mike Frysinger (UNITED STATES)

Message: 51128    it's known to be broken after updating to 2.6.24.  it'll get fixed eventually.  there's a tracker open if you want to follow it.

QuoteReplyEditDelete

 

 

2008-02-15 18:00:38     Re: Build Error for kernel/bf548

Robin Getz (UNITED STATES)

Message: 51129    Chris:

 

I would suggest to move to the 2008R1 branch. I think Mike fixed the ffplay things there too. If he didn't - just give him a nudge.

 

-Robin

Attachments

    Outcomes