[#6078] build latest toolchain failed at urjtag

Document created by Aaronwu Employee on Oct 17, 2013
Version 1Show Document
  • View in full screen mode

[#6078] build latest toolchain failed at urjtag

Submitted By: Vivi Li

Open Date

2010-06-28 00:32:58     Close Date

2010-06-28 22:39:52

Priority:

Medium     Assignee:

Mike Frysinger

Board:

N/A     Silicon Revision:

Resolution:

Fixed     Fixed In Release:

2010R1

Processor:

ALL     

Host Operating System:

toolchain rev.:

4670     kernel rev.:

8947

State:

Closed     Found In Release:

2010R1

Is this bug repeatable?:

N/A     

Summary: build latest toolchain failed at urjtag

Details:

 

Build latest toolchain failed at urjtag.

 

Last passed version:

--

toolchain svn Revision: 4650

u-boot svn Revision: 2334

uclinux-dist svn Revision: 9691

linux kernel svn Revision: 8936

--

 

First failed version:

--

toolchain svn Revision: 4670

u-boot svn Revision: 2335

uclinux-dist svn Revision: 9695

linux kernel svn Revision: 8947

--

 

Bellow is the log and error log is attached:

--

*** urjtag: building                                        27 Jun 2010 05:21:54

 

Backtrace:  (most recent call is first)

   #0: File: funcs.sh               Line:  162   Function: die_with_log

       Args:

   #1: File: autotools.sh           Line:   38   Function: run_cmd

       Args: 'make'

   #2: File: BuildToolChain         Line: 1098   Function: build_autotooled_pkg

       Args: '/home/test/work/cruise/checkouts/toolchain/urjtag' '--disable-shared' '--enable-static' '--enable-relocatable' '--with-libusb=1.0'

   #3: File: BuildToolChain         Line: 1113   Function: build_urjtag

       Args:

 

Please report an error to http://blackfin.uclinux.org/gf/project/toolchain

Build error at Sun Jun 27 05:21:54 GMT 2010

  occurred 2h23m21s into script

When reporting issue, we may ask for /home/test/work/cruise/test_scripts/toolchain/toolchain-build/toolchain-2010_Jun_27_02_44/logs/config.logs.tbz2

Last logfile entries:

libtool: install: warning: remember to run `libtool --finish //lib'

configure: WARNING: *** libftd2xx not found. No support for FTDI-based USB JTAG cables via libftd2xx.

config.status: WARNING:  '/home/test/work/cruise/checkouts/toolchain/urjtag/po/Makefile.in.in' seems to ignore the --datarootdir setting

In file included from /home/test/work/cruise/checkouts/toolchain/urjtag/src/flash/amd.c:41:

/usr/include/unistd.h:642:28: error: macro "getuid" passed 1 arguments, but takes just 0

/usr/include/unistd.h:645:29: error: macro "geteuid" passed 1 arguments, but takes just 0

make[3]: *** [amd.lo] Error 1

make[2]: *** [all-recursive] Error 1

make[1]: *** [all-recursive] Error 1

make: *** [all] Error 2

--

 

Follow-ups

 

--- Mike Frysinger                                           2010-06-28 00:44:53

should be fixed now by regenerating the autotools after all the recent patches

 

--- Vivi Li                                                  2010-06-28 22:37:01

OK now.

Close it.

 

 

 

    Files

    Changes

    Commits

    Dependencies

    Duplicates

    Associations

    Tags

 

File Name     File Type     File Size     Posted By

config.logs.tbz2    application/octet-stream    33558    Vivi Li

Attachments

Outcomes