[#6825] libstdc++ abi/header_cxxabi.c fails for missing cxxabi.h in 4.5 toolchain testing

Document created by Aaronwu Employee on Oct 17, 2013
Version 1Show Document
  • View in full screen mode

[#6825] libstdc++ abi/header_cxxabi.c fails for missing cxxabi.h in 4.5 toolchain testing

Submitted By: Mingquan Pan

Open Date

2011-10-19 04:28:59     Close Date

2011-11-09 00:47:12

Priority:

Medium     Assignee:

Mingquan Pan

Board:

N/A     Silicon Revision:

Resolution:

Fixed     Fixed In Release:

N/A

Processor:

ALL     

Host Operating System:

toolchain rev.:

    kernel rev.:

State:

Closed     Found In Release:

N/A

Is this bug repeatable?:

N/A     

Summary: libstdc++ abi/header_cxxabi.c fails for missing cxxabi.h in 4.5 toolchain testing

Details:

 

libstdc++ abi/header_cxxabi.c fails for missing cxxabi.h in 4.5 toolchain testing.

 

/home/test/work/cruise/temp/bfin-elf/libexec/gcc/bfin-elf/4.5.3/cc1^M

Executing on host: bfin-elf-gcc -g -O2 -D_GLIBCXX_ASSERT -fmessage-length=0 -Wl,--gc-sections  -DLOCALEDIR="." -I/home/test/work/cruise/checkouts/toolchain/gcc-4.5/libstdc++-v3/testsuite/util -I/home/test/work/cruise/temp/bfin-elf/lib/gcc/bfin-elf/include/c++/4.5.3 -I/home/test/work/cruise/temp/bfin-elf/lib/gcc/bfin-elf/include/c++/4.5.3/bfin-elf -I/home/test/work/cruise/temp/bfin-elf/include/c++/4.5.3 -I/home/test/work/cruise/temp/bfin-elf/include/c++/4.5.3/bfin-elf -L/home/test/work/cruise/temp/bfin-elf/lib /home/test/work/cruise/checkouts/toolchain/gcc-4.5/libstdc++-v3/testsuite/abi/header_cxxabi.c    -S  -msim -msim -o header_cxxabi.s    (timeout = 600)

/home/test/work/cruise/checkouts/toolchain/gcc-4.5/libstdc++-v3/testsuite/abi/header_cxxabi.c:21:20: fatal error: cxxabi.h: No such file or directory^M

compilation terminated.^M

compiler exited with status 1

output is:

/home/test/work/cruise/checkouts/toolchain/gcc-4.5/libstdc++-v3/testsuite/abi/header_cxxabi.c:21:20: fatal error: cxxabi.h: No such file or directory^M

compilation terminated.^M

 

FAIL: abi/header_cxxabi.c (test for excess errors)

Excess errors:

/home/test/work/cruise/checkouts/toolchain/gcc-4.5/libstdc++-v3/testsuite/abi/header_cxxabi.c:21:20: fatal error: cxxabi.h: No such file or directory

compilation terminated.

 

extra_tool_flags are:

 

 

Follow-ups

 

--- Stuart Henderson                                         2011-10-19 10:23:47

fixed on trunk and 2011R1.

 

--- Mingquan Pan                                             2011-11-09 00:57:59

Yes, it passes now.

 

Executing on host: bfin-elf-gcc -g -O2 -D_GLIBCXX_ASSERT -fmessage-length=0

-Wl,--gc-sections  -DLOCALEDIR="."

-I/home/test/work/cruise/checkouts/toolchain/gcc-4.5/libstdc++-v3/testsuite/util

-I/home/test/work/cruise/temp/bfin-elf/lib/gcc/bfin-elf/4.5.3/include/c++

-I/home/test/work/cruise/temp/bfin-elf/lib/gcc/bfin-elf/4.5.3/include/c++/bfin-elf

-I/home/test/work/cruise/temp/bfin-elf/include/c++/4.5.3

-I/home/test/work/cruise/temp/bfin-elf/include/c++/4.5.3/bfin-elf

-L/home/test/work/cruise/temp/bfin-elf/lib

/home/test/work/cruise/checkouts/toolchain/gcc-4.5/libstdc++-v3/testsuite/abi/header_cxxabi.c

   -S  -msim -msim -o header_cxxabi.s    (timeout = 600)

PASS: abi/header_cxxabi.c (test for excess errors)

extra_tool_flags are:

 

So close.

 

 

 

    Files

    Changes

    Commits

    Dependencies

    Duplicates

    Associations

    Tags

 

File Name     File Type     File Size     Posted By

No Files Were Found

Attachments

    Outcomes